Экономическая единица
type: Concept
source: Финансово-кредитный энциклопедический словарь
  source: https://suz.cisstat.org/xwiki/bin/view/%D0%91%D0%B8%D0%B1%D0%BB%D0%B8%D0%BE%D1%82%D0%B5%D0%BA%D0%B0/%D0%A4%D0%B8%D0%BD%D0%B0%D0%BD%D1%81%D0%BE%D0%B2%D0%BE-%D0%BA%D1%80%D0%B5%D0%B4%D0%B8%D1%82%D0%BD%D1…
requires: LegalEntity
requires: RestOfTheWorld
requires: Household
requires: Transaction
requires: Enterprise
term status: draft
definition: Экономическая единица (англ. economic agent) — в системе национальных счетов — юридическое или физическое лицо, совершающее экономическую операцию. В качестве экономической единицы могут выступать отдельное лицо, домохозяйство, коллективы, предприятия, учреждения, организации, экономические регионы, отрасли и сектора экономики, государство. Особой экономической единицей является заграница («остальной мир»).
in scheme: Глоссарий
top concept of: Глоссарий

Элементарный агрегат
type: Concept
comment: Элементарный агрегат должен состоять из относительно однородного набора товаров или услуг с аналогичным конечным использованием и аналогичной ожидаемой динамикой цен.
comment: An elementary aggregate should consist of relatively homogeneous set of goods or services, with similar end-uses and similar expected price movements.
source: Руководство по индексам потребительских цен: Концепции и Методы
  source: https://suz.cisstat.org/xwiki/wiki/Prices/view/%D0%91%D0%B8%D0%B1%D0%BB%D0%B8%D0%BE%D1%82%D0%B5%D0%BA%D0%B0/%D0%A0%D1%83%D0%BA%D0%BE%D0%B2%D0%BE%D0%B4%D1%81%D1%82%D0%B2%D0%BE%20%D0%BF%D0%BE%20%D0%B8%D…
requires: Веса
requires: Services
requires: Goods
term status: submitted
definition: Элементарный агрегат — это самый низкий уровень групп товаров или услуг, которым присваиваются веса, остающиеся неизменными в течение одного года или более длительного периода.
definition: Elementary aggregate is the lowest level of groups of goods or services for which expenditure weights are assigned and held constant for a period of one year or more.
in scheme: Глоссарий
preferred label: Elementary aggregate
related: Services
related: Goods
related: Price
top concept of: Глоссарий

Глоссарий
type: ConceptScheme
comment: При разработке глоссария использовались результаты анализа документов и материалов, внешних источников, словарей и энциклопедий по разделу, а также результаты гармонизации понятий.
version info: 24.1
definition: Глоссарий представляет собой словарь специализированных терминов, общих для различных разделов статистики. Формируется путем выделения общей статистической терминологии из глоссариев разделов. Глоссарий реализован как совокупность концептов, имеющих толкование (лексическое отражение), с поддержкой мультиязычности, комментариев и примеров, а также семантических отношений между концептами.
has top concept: Экономическая единица
has top concept: Базисный период
has top concept: Экономическая деятельность
has top concept: Элементарный агрегат
has top concept: Население
has top concept: Веса
has top concept: Возраст
has top concept: Национальная территория
has top concept: Текущий период

Текущий период
type: Concept
comment: The term is widely used, however, to mean the comparison period; that is, the period that is compared with the base period.
comment: Термин широко используется для обозначения сравниваемого периода, то есть периода, который сравнивается с базисным.
source: Руководство по индексам потребительских цен: Теория и практика
  source: https://suz.cisstat.org/xwiki/wiki/Prices/view/%D0%91%D0%B8%D0%B1%D0%BB%D0%B8%D0%BE%D1%82%D0%B5%D0%BA%D0%B0/%D0%A0%D1%83%D0%BA%D0%BE%D0%B2%D0%BE%D0%B4%D1%81%D1%82%D0%B2%D0%BE%20%D0%BF%D0%BE%20%D0%B8%D…
term status: submitted
definition: Current period is the later of the two periods being compared.
definition: Текущий период — это последний из двух сопоставляемых периодов.
in scheme: Глоссарий
preferred label: Current period
top concept of: Глоссарий

Базисный период
type: Concept
comment: Можно выделить три типа базисных периодов: Базисный период цен — это период, с ценами которого сопоставляются цены других периодов. Цены базисного периода цен выступают в качестве знаменателей в соотношениях цен или ценовых коэффициентах, используемых для расчета индекса. Базисный период цен обычно обозначается как период 0; Базисный период весов — период (обычно один год или несколько лет), расходы за который служат весами для индекса; Базисный период индексов — период, для которого значение индекса устанавливается равным 100.
comment: Three types of base period may be distinguished: • the price reference period - the period that provides the prices to which the prices in other periods are compared. The prices of the price reference period appear in the denominators of the price relatives, or price ratios, used to calculate the index. The price reference period is typically designated as period 0; • the weight reference period - the period, usually one or more years, of which the expenditures serve as weights for the index.; • the index reference period - the period for which the value of the index is set equal to 100.
source: Руководство по индексам потребительских цен: Теория и практика
  source: https://suz.cisstat.org/xwiki/wiki/Prices/view/%D0%91%D0%B8%D0%B1%D0%BB%D0%B8%D0%BE%D1%82%D0%B5%D0%BA%D0%B0/%D0%A0%D1%83%D0%BA%D0%BE%D0%B2%D0%BE%D0%B4%D1%81%D1%82%D0%B2%D0%BE%20%D0%BF%D0%BE%20%D0%B8%D…
term status: submitted
definition: Базисный период — это период, с которым сопоставляются все прочие периоды.
definition: The base period is usually understood to mean the period with which all the other periods are compared.
in scheme: Глоссарий
preferred label: Base period
related: Веса
related: Price
top concept of: Глоссарий

Экономическая деятельность
type: Concept
comment: An activity is characterized by (a) an input of resources; (b) a production process; and (c) an output of products. By convention, a single activity is understood as a process resulting in a homogeneous type of product. It is recognized that one activity may consist of one simple process or may cover a whole range of sub-processes, each of which might be classified in a different activity category.
comment: Признаками экономической деятельности являются: a) вложение ресурсов; b) производственный процесс; c) получение продуктов. Принято считать, что под одним видом деятельности понимается процесс, результатом которого является однородный вид продуктов. Общепризнано, что один вид деятельности может состоять из одного простого процесса или может включать в себя широкий спектр подчиненных процессов, каждый из которых может классифицироваться в различных категориях видов деятельности.
source: Международные рекомендации по промышленной статистике, 2008 г. (IRIS 2008)
  source: https://suz.cisstat.org/xwiki/wiki/Industry/view/%D0%91%D0%B8%D0%B1%D0%BB%D0%B8%D0%BE%D1%82%D0%B5%D0%BA%D0%B0/%D0%9C%D0%B5%D0%B6%D0%B4%D1%83%D0%BD%D0%B0%D1%80%D0%BE%D0%B4%D0%BD%D1%8B%D0%B5%20%D1%80%D0…
requires: Work
requires: Production
requires: Services
requires: Products
requires: Goods
term status: draft
definition: Экономическая деятельность — процесс, а именно комбинация действий, осуществляемых неким хозяйствующим субъектом, который использует трудовые ресурсы, капитал, товары и услуги для производства конкретных видов продукта (товаров, работ, услуг).
definition: Economic activity is understood as referring to a process, that is to say, to the combination of actions carried out by a certain entity that uses labour, capital, goods and services to produce specific products (goods and services).
in scheme: Глоссарий
preferred label: Economic activity
related: Products
top concept of: Глоссарий

Население
type: Concept
comment: Население необходимо рассматривать не только как совокупность отдельных лиц, но и как совокупность домохозяйств и семей.
source: Энциклопедия статистических терминов Том 5, подраздел 5.1. "Демографическая статистика"
  source: https://suz.cisstat.org/xwiki/wiki/population/view/%D0%91%D0%B8%D0%B1%D0%BB%D0%B8%D0%BE%D1%82%D0%B5%D0%BA%D0%B0/%D0%AD%D0%BD%D1%86%D0%B8%D0%BA%D0%BB%D0%BE%D0%BF%D0%B5%D0%B4%D0%B8%D1%8F%20%D1%81%D1%82%…
term status: draft
alternative label: Народонаселение
definition: Population - a set of people, changing continuously under the influence of demographic events, which change its number and composition.
definition: Население — совокупность людей, изменяющаяся непрерывно под влиянием происходящих в ней демографических событий, которые меняют его как численность, так и состав.
in scheme: Глоссарий
preferred label: Population
related: Household
top concept of: Глоссарий

Веса
type: Concept
comment: В контексте ИПЦ веса обычно являются долями фактических расходов, сумма которых, по определению, составляет единицу. Они используются для усреднения соотношений цен, или для агрегирования элементарных индексов цен.
comment: In a CPI context, the weights are generally actual or hybrid expenditure shares that sum to unity by definition. They are used to average price relatives or elementary price indices.
source: Руководство по индексам потребительских цен: Концепции и Методы
  source: https://suz.cisstat.org/xwiki/wiki/Prices/view/%D0%91%D0%B8%D0%B1%D0%BB%D0%B8%D0%BE%D1%82%D0%B5%D0%BA%D0%B0/%D0%A0%D1%83%D0%BA%D0%BE%D0%B2%D0%BE%D0%B4%D1%81%D1%82%D0%B2%D0%BE%20%D0%BF%D0%BE%20%D0%B8%D…
term status: submitted
definition: Веса — это совокупность чисел, в сумме равных единице, которые используются при расчёте средних величин.
definition: Weights is a set of numbers summing to unity that are used to calculate averages.
in scheme: Глоссарий
preferred label: Weights
related: Price
top concept of: Глоссарий

Возраст
type: Concept
comment: Для совершеннолетних и детей возраст обычно измеряется в полных годах, тогда как для младенцев и малолетних детей — в полных месяцах, неделях, днях, часах или минутах жизни, в зависимости от случая.
source:
  source: https://suz.cisstat.org/xwiki/bin/view/%D0%93%D0%B0%D1%80%D0%BC%D0%BE%D0%BD%D0%B8%D0%B7%D0%B0%D1%86%D0%B8%D1%8F/%D0%93%D0%B0%D1%80%D0%BC%D0%BE%D0%BD%D0%B8%D0%B7%D0%B0%D1%86%D0%B8%D1%8F%20%D0%BF%D0%BE%…
term status: draft
definition: Age - the interval of time between birth and the present time, expressed in completed units of solar time.
definition: Возраст — период от рождения до достижения физическим лицом определенного момента жизни, выраженный в полных годах.
in scheme: Глоссарий
preferred label: Age
top concept of: Глоссарий

Национальная территория
type: Concept
source: МОМ ООН. Справочник по терминологии в области миграции
  source: https://suz.cisstat.org/xwiki/bin/view/%D0%91%D0%B8%D0%B1%D0%BB%D0%B8%D0%BE%D1%82%D0%B5%D0%BA%D0%B0/%D0%9C%D0%9E%D0%9C%20%D0%9E%D0%9E%D0%9D.%20%D0%A1%D0%BF%D1%80%D0%B0%D0%B2%D0%BE%D1%87%D0%BD%D0%B8%D0…
term status: draft
definition: Национальная территория — географические районы, принадлежащие или находящиеся под юрисдикцией государства.
definition: National territory - geographical areas belonging to or under the jurisdiction of a state.
in scheme: Глоссарий
preferred label: National Territory
top concept of: Глоссарий