Местная единица вида деятельности
type: Concept
comment: Каждая единица вида деятельности должна иметь по крайней мере одну местную единицу вида деятельности; при этом единица вида деятельности может быть составлена путём объединения частей одной или нескольких местных единиц. С другой стороны, местная единица может при определенных обстоятельствах включать в себя только группу вспомогательных единиц. В этом случае СНС 2008 года рекомендует рассматривать такие вспомогательные единицы в качестве заведений.
comment: Each kind-of-activity unit must have at least one local kind-of-activity unit; however, the kind-of-activity unit can be made up of a grouping of parts of one or more local units. On the other hand, a local unit may, in certain circumstances, solely encompass a group of ancillary units. In this instance, the 2008 SNA, recommends that these ancillary units be treated as establishments. The local kind-of-activity unit corresponds to the establishment.
source: Международные рекомендации по промышленной статистике, 2008 г. (IRIS 2008)
  source: https://suz.cisstat.org/xwiki/wiki/Industry/view/%D0%91%D0%B8%D0%B1%D0%BB%D0%B8%D0%BE%D1%82%D0%B5%D0%BA%D0%B0/%D0%9C%D0%B5%D0%B6%D0%B4%D1%83%D0%BD%D0%B0%D1%80%D0%BE%D0%B4%D0%BD%D1%8B%D0%B5%20%D1%80%D0…
requires: LocalUnit
requires: Kind-of-ActivityUnit
term status: draft
broader: Concept-3147278851378145486
broader: Concept-7083607626823533293
definition: Local kind-of-activity unit is the part of a kind-of-activity unit that corresponds to a local unit.
definition: Местная единица вида деятельности — это часть единицы вида деятельности, которая соответствует местной единице.
in scheme: Глоссарий
preferred label: Local kind-of-activity unit
related: LocalUnit
related: Kind-of-ActivityUnit
related: Establishment
top concept of: Глоссарий

Давальческое сырье
type: Concept
comment: Данные о производстве промышленной продукции в натуральном выражении приводятся по валовому выпуску продукции, то есть, включая данные о продукции, израсходованной на промышленно-производственные нужды внутри данной организации, а также выработанной из давальческого сырья.
source: Методологические положения по статистике промышленности
  source: https://suz.cisstat.org/xwiki/wiki/Industry/view/%D0%91%D0%B8%D0%B1%D0%BB%D0%B8%D0%BE%D1%82%D0%B5%D0%BA%D0%B0/%D0%9C%D0%B5%D1%82%D0%BE%D0%B4%D0%BE%D0%BB%D0%BE%D0%B3%D0%B8%D1%87%D0%B5%D1%81%D0%BA%D0%B8…
requires: Production
requires: Products
term status: draft
definition: Давальческое сырье — это сырье, принадлежащее заказчику и переданное на переработку другим организациям для производства из него продукции в соответствии с заключенными договорами.
definition: Provided raw materials - raw material that belongs to the customer and is transferred to other organizations for processing in order to produce goods from it in accordance with the concluded contracts/agreements.
in scheme: Глоссарий
preferred label: Provided raw materials
related: Production
related: Output
related: Промышленная продукция
related: Products
top concept of: Глоссарий

Оборот
type: Concept
comment: В оборот не включается предоставление продукции и услуг между подразделениями в структуре предприятия, а также доходы от продажи или передачи основных средств, продажа земельных участков и активов, находящихся в собственности, выпуск и продажа акций, процентные и дивидендные поступления и прочие финансовые поступления.
source: Методика расчета индекса промышленного производства (Молдова)
  source: https://suz.cisstat.org/xwiki/wiki/Industry/view/%D0%9C%D0%BE%D0%BB%D0%B4%D0%BE%D0%B2%D0%B0/%D0%91%D0%B8%D0%B1%D0%BB%D0%B8%D0%BE%D1%82%D0%B5%D0%BA%D0%B0/%D0%9C%D0%B5%D1%82%D0%BE%D0%B4%D0%B8%D0%BA%D0%B…
requires: SecondaryActivity
requires: Enterprise
requires: PrincipalActivity
term status: draft
definition: Оборот — общая выручка, учтенная предприятием с основной производственной деятельностью за соответствующий период, полученная как от его основной, так и от вторичной деятельности.
definition: Turnover - the amount invoiced by the establishment during the reference period and corresponds to market sales (shipments, receipts for services and other revenues) of goods or services, both primary and secondary, including goods and services transferred to other establishments of the same enterprise.
in scheme: Глоссарий
preferred label: Turnover
related: Services
related: Asset
related: Enterprise
related: Products
top concept of: Глоссарий

Промышленная продукция
type: Concept
comment: Коды номенклатурных позиций промышленной продукции соответствуют <a target="_blank" rel="noopener noreferrer" href="https://suz.cisstat.org/xwiki/wiki/Industry/view/%D0%91%D0%B8%D0%B1%D0%BB%D0%B8%D0%BE%D1%82%D0%B5%D0%BA%D0%B0/%D0%9C%D0%BE%D0%B4%D0%B5%D0%BB%D1%8C%D0%BD%D1%8B%D0%B9%20%D1%81%D1%82%D0%B0%D1%82%D0%B8%D1%81%D1%82%D0%B8%D1%87%D0%B5%D1%81%D0%BA%D0%B8%D0%B9%20%D0%BA%D0%BB%D0%B0%D1%81%D1%81%D0%B8%D1%84%D0%B8%D0%BA%D0%B0%D1%82%D0%BE%D1%80%20%D0%BF%D1%80%D0%BE%D0%B4%D1%83%D0%BA%D1%86%D0%B8%D0%B8%20%28%D1%82%D0%BE%D0%B2%D0%B0%D1%80%D0%BE%D0%B2%20%D0%B8%20%D1%83%D1%81%D0%BB%D1%83%D0%B3%29%20%28%D0%A1%D0%9A%D0%9F%20%E2%80%93%202%29/">Модельному статистическому классификатору продукции (СКП-2), разработанному Статкомитетом СНГ. Промышленная продукция учитывается по валовому выпуску, включая изделия, использованные на промышленно-производственные нужды внутри предприятия. В данные о производстве включается продукция, выработанная юридическим лицом (независимо от вида основной деятельности) как из собственного сырья и материалов, так и из неоплачиваемых сырья и материалов заказчика (давальческого), предназначенная для отпуска другим юридическим и физическим лицам, своему капитальному строительству и своим подразделениям, зачисленная в состав основных средств или оборотных активов (например, спецодежда, спецоснастка), выданная своим работникам в счет оплаты труда, а также израсходованная на собственные производственные нужды.
source: Гармонизация понятия "Промышленная продукция"
  source: https://suz.cisstat.org/xwiki/wiki/Industry/view/%D0%93%D0%B0%D1%80%D0%BC%D0%BE%D0%BD%D0%B8%D0%B7%D0%B0%D1%86%D0%B8%D1%8F/%D0%93%D0%B0%D1%80%D0%BC%D0%BE%D0%BD%D0%B8%D0%B7%D0%B0%D1%86%D0%B8%D1%8F%20%D0…
requires: EconomicActivity
requires: Production
requires: Services
requires: Products
term status: inprogress
alternative label: Industrial production
alternative label: Продукция промышленности
broader: Concept2302097425286449503
definition: Industrial products – the totality of types, kinds, and brands of produced goods (works, services) according to economic activities related to the industrial sector.
definition: Промышленная продукция — совокупность видов, типов, марок выпускаемой продукции (работ, услуг) по видам экономической деятельности, относящимся к добыче полезных ископаемых, обрабатывающим производствам, обеспечению электрической энергией, газом и паром, кондиционированию воздуха, водоснабжению, водоотведению, организации сбора и утилизации отходов, а также ликвидации загрязнений.
in scheme: Глоссарий
preferred label: Industrial products
related: LegalEntity
related: Давальческое сырье
related: Production
related: Asset
related: Enterprise
related: PrincipalActivity
related: Earnings
related: Products
top concept of: Глоссарий

Валовой выпуск промышленной продукции
type: Concept
comment: Термин «Валовой выпуск промышленной продукции» формируется в соответствии с международными стандартами. В качестве методологической основы использована Система национальных счетов 2008 года. Данный термин является отраслевой адаптацией термина «Выпуск». Валовой выпуск промышленной продукции рассчитывается по видам экономической деятельности в соответствии с национальными классификаторами, основанными на Статистической классификации видов экономической деятельности Европейского союза (КДЕС Ред.2 / NACE Rev.2). К собирательной классификационной группировки видов экономической деятельности «промышленность» относятся раздел B «Добыча полезных ископаемых», раздел C «Обрабатывающие производства», раздел D «Обеспечение электрической энергией, газом и паром, кондиционирование воздуха» и раздел Е «Водоснабжение, водоотведение, организация сбора и утилизации отходов, деятельность по ликвидации загрязнений».
requires: Production
requires: Establishment
requires: Consumption
requires: Services
requires: Goods
term status: draft
broader: Concept-4557026121484801594
definition: Валовой выпуск промышленной продукции — результат общей производственной деятельности промышленных единиц (заведений), определяется как суммарная стоимость всех товаров и услуг, фактически произведенных или оказанных в рамках заведения и доступных для использования за пределами этого заведения, с учетом любых товаров и услуг для собственного конечного потребления.
definition: Gross industrial output of industrial production is the result of the overall production activity of industrial units (establishments). It is defined as the total value of all goods and services actually produced or provided within the establishment and available for use outside the establishment, including any goods and services intended for own final consumption.
in scheme: Глоссарий
preferred label: Gross output of industrial production
related: EconomicActivity
related: Output
top concept of: Глоссарий

Продукция с длительным циклом производства
type: Concept
comment: Продукция с длительным циклом производства, по которой расчёты с заказчиками ведутся отдельными этапами, в соответствии с заключенными договорами, включается в объем промышленного производства по стоимости законченных и принятых заказчиком в установленном порядке этапов.
comment: If the establishment engages in the production of goods under contract with a long-term production cycle, progress payments receivable under such contracts should be included here as sale, not as work-in-progress. This is applicable to both the construction work and the production of machinery and equipment. When no contract exists, partially completed or finished construction work and machinery should be recorded in the inventory under work-in-progress or finished goods.
source: Методические положения по оценке стоимости общего объема промышленного производства
  source: https://suz.cisstat.org/xwiki/wiki/Industry/view/%D0%A3%D0%B7%D0%B1%D0%B5%D0%BA%D0%B8%D1%81%D1%82%D0%B0%D0%BD/%D0%91%D0%B8%D0%B1%D0%BB%D0%B8%D0%BE%D1%82%D0%B5%D0%BA%D0%B0/%D0%9C%D0%B5%D1%82%D0%BE%D0%B…
requires: Production
requires: Products
term status: inprogress
alternative label: Продукция с длительным технологическим циклом производства
broader: Concept2302097425286449503
definition: Продукция с длительным циклом производства — продукция, продолжительность производственного цикла которой в соответствии с установленной технологией составляет более одного отчётного периода и производство которой в отчетном периоде не завершено, расчёты с заказчиком за которую осуществляются по отдельным платежным этапам (технологическим учётным единицам) или после изготовления изделия в целом.
in scheme: Глоссарий
preferred label: Products with a long-term production cycle
related: Production
top concept of: Глоссарий

Единица наблюдения
type: Concept
comment: Единицы наблюдения и аналитические единицы определяются таким образом, чтобы обеспечить составление данных по местной, региональной и национальной экономике. Географические критерии полезны с точки зрения возможности обеспечить суммирование единиц и избежать их пропуска и дублирования.
source: Международные рекомендации по промышленной статистике, 2008 г. (IRIS 2008)
  source: https://suz.cisstat.org/xwiki/wiki/Industry/view/%D0%91%D0%B8%D0%B1%D0%BB%D0%B8%D0%BE%D1%82%D0%B5%D0%BA%D0%B0/%D0%9C%D0%B5%D0%B6%D0%B4%D1%83%D0%BD%D0%B0%D1%80%D0%BE%D0%B4%D0%BD%D1%8B%D0%B5%20%D1%80%D0…
term status: draft
broader: Статистическая единица
definition: Единица наблюдения — поддающийся идентификации организационно-правовой или физический субъект, способный фактически или потенциально предоставлять отчетные данные о своей деятельности
definition: Observation units — identifiable legal/organizational or physical entities that are able, actually or potentially, to report data regarding their activities.
in scheme: Глоссарий
preferred label: Observation unit
related: Аналитическая единица
top concept of: Глоссарий

Тип правовой организации
type: Concept
comment: Тип правовой организации является возможным критерием для стратификации хозяйствующих субъектов в статистических обследованиях.
source: Международные рекомендации по промышленной статистике, 2008 г. (IRIS 2008)
  source: https://suz.cisstat.org/xwiki/wiki/Industry/view/%D0%91%D0%B8%D0%B1%D0%BB%D0%B8%D0%BE%D1%82%D0%B5%D0%BA%D0%B0/%D0%9C%D0%B5%D0%B6%D0%B4%D1%83%D0%BD%D0%B0%D1%80%D0%BE%D0%B4%D0%BD%D1%8B%D0%B5%20%D1%80%D0…
requires: Establishment
requires: Enterprise
term status: draft
definition: The kind of legal organization is the legal form of the economic entity that owns the unit (either the enterprise or the establishment).
definition: Тип правовой организации — это правовая форма хозяйствующего субъекта, который владеет данной единицей (предприятием или заведением).
in scheme: Глоссарий
preferred label: The kind of legal organization
top concept of: Глоссарий

Аналитическая единица
type: Concept
comment: Единицы наблюдения и аналитические единицы определяются таким образом, чтобы обеспечить составление данных по местной, региональной и национальной экономике. Географические критерии полезны с точки зрения возможности обеспечить суммирование единиц и избежать их пропуска и дублирования.
source: Международные рекомендации по промышленной статистике, 2008 г. (IRIS 2008)
  source: https://suz.cisstat.org/xwiki/wiki/Industry/view/%D0%91%D0%B8%D0%B1%D0%BB%D0%B8%D0%BE%D1%82%D0%B5%D0%BA%D0%B0/%D0%9C%D0%B5%D0%B6%D0%B4%D1%83%D0%BD%D0%B0%D1%80%D0%BE%D0%B4%D0%BD%D1%8B%D0%B5%20%D1%80%D0…
requires: Единица наблюдения
term status: draft
broader: Статистическая единица
definition: Аналитическая единица — субъект, создаваемый статистиками (называемые также статистическими конструкциями) зачастую путем разделения или объединения единиц наблюдения в целях составления статистических показателей, которые являются более подробными и более однородными, чем показатели, которые возможно составить, используя данные по единицам наблюдения.
definition: Analytical unit - entities created by statisticians (also referred to as statistical constructs), often by splitting or combining observation units in order to compile statistics that are more detailed and more homogeneous than it would be possible to compile by using data on observation units. Although analytical units are not themselves able to report data on their activities, there do exist indirect methods of statistical estimation, including imputation of such data.
in scheme: Глоссарий
preferred label: Analytical unit
related: Единица наблюдения
top concept of: Глоссарий

Дефлятирование
type: Concept
comment: Процедура дефлятирования позволяет устранить эффект влияния цены при проведении оценки изменения физического объема производства. Для обеспечения единства методологии оценки динамики производства по товарам-представителям в натуральном выражении и методом дефлятирования необходимы индексы-дефляторы, позволяющие пересчитать стоимостные оценки по товару в действующих ценах в средние цены года, принятого в качестве базисного.
source: Гармонизация понятия "Дефлятирование"
  source: https://suz.cisstat.org/xwiki/wiki/Industry/view/%D0%93%D0%B0%D1%80%D0%BC%D0%BE%D0%BD%D0%B8%D0%B7%D0%B0%D1%86%D0%B8%D1%8F/%D0%93%D0%B0%D1%80%D0%BC%D0%BE%D0%BD%D0%B8%D0%B7%D0%B0%D1%86%D0%B8%D1%8F%20%D0…
requires: Products
term status: draft
definition: Дефлятирование — процедура выделения компонента физического объема (физического количества и качества продукции) из данных, содержащих два компонента — ценовой компонент и компонент физического объема.
definition: Deflation is defined as isolating the volume component (that is quantity and quality) from variables that have price and volume elements.
in scheme: Глоссарий
preferred label: Deflation
related: Production
related: SampledProduct
related: Goods
top concept of: Глоссарий

Статистическая единица
type: Concept
comment: Именно статистическая единица составляет основу суммарных статистических показателей и к ней относятся табулированные данные.
source: Международные рекомендации по промышленной статистике, 2008 г. (IRIS 2008)
  source: https://suz.cisstat.org/xwiki/wiki/Industry/view/%D0%91%D0%B8%D0%B1%D0%BB%D0%B8%D0%BE%D1%82%D0%B5%D0%BA%D0%B0/%D0%9C%D0%B5%D0%B6%D0%B4%D1%83%D0%BD%D0%B0%D1%80%D0%BE%D0%B4%D0%BD%D1%8B%D0%B5%20%D1%80%D0…
term status: draft
definition: Statistical unit is an entity about which information is sought and for which statistics are ultimately compiled.
definition: Статистическая единица — это тот или иной субъект, в отношении которого запрашивается информация и для которого в конечном счете составляются статистические данные.
in scheme: Глоссарий
preferred label: Statistical unit
top concept of: Глоссарий

Глоссарий
type: ConceptScheme
comment: При разработке глоссария использовались результаты анализа документов и материалов, внешних источников, словарей и энциклопедий по разделу, а также результаты гармонизации понятий.
version info: 53.1
definition: Глоссарий раздела "Промышленность" Глоссарий представляет собой словарь узкоспециализированных терминов раздела и формируется на основе анализа методологических документов, толковых словарей и энциклопедий в области статистики промышленности. Глоссарий реализован как совокупность концептов, имеющих толкование (лексическое отражение), с поддержкой мультиязычности, комментариев и примеров, а также семантических отношений между концептами.
has top concept: Единица наблюдения
has top concept: Местная единица вида деятельности
has top concept: Ребазирование
has top concept: Аутсорсинг
has top concept: Оборот
has top concept: Промышленная продукция
has top concept: Сцепление
has top concept: Тип правовой организации
has top concept: Давальческое сырье
has top concept: Аналитическая единица
has top concept: Взвешивание
has top concept: Валовой выпуск промышленной продукции
has top concept: Продукция с длительным циклом производства
has top concept: Дефлятирование
has top concept: Статистическая единица

Аутсорсинг
type: Concept
comment: Аутсорсинг может осуществляться в трех формах, а именно: аутсорсинг вспомогательных функций, аутсорсинг частей производственного процесса, аутсорсинг всего производственного процесса. В каждом из этих случаев заказчик и подрядчик могут располагаться в одном и том же или в разных местах проведения хозяйственной деятельности.
comment: Outsourcing can be carried out in three forms: outsourcing of ancillary functions, outsourcing of parts of the production process, outsourcing of the entire production process.
source: Гармонизация понятия "Аутсорсинг"
  source: https://suz.cisstat.org/xwiki/wiki/Industry/view/%D0%93%D0%B0%D1%80%D0%BC%D0%BE%D0%BD%D0%B8%D0%B7%D0%B0%D1%86%D0%B8%D1%8F/%D0%93%D0%B0%D1%80%D0%BC%D0%BE%D0%BD%D0%B8%D0%B7%D0%B0%D1%86%D0%B8%D1%8F%20%D0…
requires: Production
requires: Services
requires: Goods
term status: draft
definition: The term outsourcing in the field of industrial production is used to refer to a situation where the main production unit (the customer) outsources to another production unit (the contractor) the performance of specific functions that include, in whole or in part, the customer's activities for the production of a product or service
definition: Аутсорсинг — передача основной производственной единицей (заказчиком) в подряд другой производственной единице (подрядчику) осуществление конкретных функций, включающих полностью или частично деятельность заказчика по производству того или иного товара или услуги.
in scheme: Глоссарий
preferred label: Outsourcing
top concept of: Глоссарий

Ребазирование
type: Concept
comment: Обычно, когда веса для индекса обновляются, новый базисный для весов период традиционно принимается за «100».
source:
  source: https://suz.cisstat.org/xwiki/wiki/Industry/view/%D0%93%D0%B0%D1%80%D0%BC%D0%BE%D0%BD%D0%B8%D0%B7%D0%B0%D1%86%D0%B8%D1%8F/%D0%93%D0%B0%D1%80%D0%BC%D0%BE%D0%BD%D0%B8%D0%B7%D0%B0%D1%86%D0%B8%D1%8F%20%D0…
requires: Weights
requires: Transaction
term status: draft
alternative label: Смена базового периода
alternative label: Re-referencing
definition: Ребазирование — математическая операция, заключающаяся в делении всех значений ряда индексов на старый индекс за новый базисный для весов период и умножения на 100.
definition: Re-referancing - updating the reference period to equal 100.0
in scheme: Глоссарий
preferred label: Сhange of the base period
related: Weights
top concept of: Глоссарий

Сцепление
type: Concept
comment: При расчёте индексов важное значение имеет использование весовых коэффициентов (весов), см. термин «взвешивание», которые необходимо периодически обновлять.­
source: Практичeское пособие по индексу промышленного производства для стран СНГ
  source: https://suz.cisstat.org/xwiki/wiki/Industry/view/%D0%9C%D0%B5%D1%82%D0%BE%D0%B4%D0%BE%D0%BB%D0%BE%D0%B3%D0%B8%D1%8F/%D0%9F%D1%80%D0%B0%D0%BA%D1%82%D0%B8%D1%87e%D1%81%D0%BA%D0%BE%D0%B5%20%D0%BF%D0%BE%D…
requires: Weights
term status: inprogress
definition: Сцепление — вычислительная процедура, для которой требуются данные за период перекрытия индексов, опирающихся на старые и новые веса.
definition: Processes of linking which is a simple numerical operation requiring estimates for an overlapping period of the index using both the old and new weights
in scheme: Глоссарий
preferred label: Linking
related: Weights
related: Взвешивание
top concept of: Глоссарий

Взвешивание
type: Concept
comment: Весовые коэффициенты (веса) позволяют «складывать» или комбинировать индексы более низкого уровня для получения агрегированных показателей после того, как все необходимые входные переменные были собраны, условно исчислены и скорректированы по мере необходимости. Весовые коэффициенты являются ключевым элементом в построении любого индекса, поскольку они обеспечивают меру относительной важности каждого компонента индекса. В случае ИПП веса отражают относительную важность продукта, группы продуктов или отрасли в общем объёме промышленного производства.
source:
  source: https://suz.cisstat.org/xwiki/wiki/Industry/view/%D0%93%D0%B0%D1%80%D0%BC%D0%BE%D0%BD%D0%B8%D0%B7%D0%B0%D1%86%D0%B8%D1%8F/%D0%93%D0%B0%D1%80%D0%BC%D0%BE%D0%BD%D0%B8%D0%B7%D0%B0%D1%86%D0%B8%D1%8F%20%D0…
term status: inprogress
definition: Weighting is a fundamental methodological technique designed to correctly compare quantitative values ​​of indicators, taking into account their qualitative significance.
definition: Взвешивание — это фундаментальный методический приём, предназначенный для корректного сопоставления количественных значений показателей с учётом их качественной значимости.
in scheme: Глоссарий
preferred label: Weighting
related: Weights
related: Production
related: Products
top concept of: Глоссарий