Резидентство
type: Concept
requires: Институциональная единица
term status: draft
definition: Резидентство каждой институциональной единицы — это экономическая территория, с которой она имеет наиболее тесную связь, другими словами, на которой находится центр ее преобладающего экономического интереса.
definition: The residence of each institutional unit is the economic territory with which it has the strongest connection, in other words, its centre of predominant economic interest.
in scheme: Глоссарий
preferred label: Residence
top concept of: Глоссарий

Остальной мир
type: Concept
comment: Он не является сектором, для которого должен составляться полный набор счетов, хотя часто удобно описать остальной мир, как если бы он был сектором. Счета или таблицы для остального мира содержат записи только об операциях между резидентами и нерезидентами или о других экономических отношениях, таких как требования резидентов к нерезидентам и наоборот. Остальной мир включает некоторые институциональные единицы, которые, возможно, физически расположены на географической территории данной страны; например, такие иностранные анклавы, как посольства, консульства или военные базы, а также международные организации.
requires: Институциональная единица
term status: draft
definition: The rest of the world consists of all non-resident institutional units that enter into transactions with resident units, or have other economic links with resident units.
definition: Остальной мир охватывает все нерезидентские институциональные единицы, которые участвуют в операциях с резидентскими единицами или имеют другие экономические связи с резидентскими единицами данной страны.
in scheme: Глоссарий
preferred label: Rest of the world
related: Институциональная единица
top concept of: Глоссарий

Валовая добавленная стоимость
type: Concept
comment: Поскольку добавленная стоимость предназначена для измерения стоимости, созданной в процессе производства, она должна быть измерена на чистой основе, так как потребление основного капитала представляет собой статью затрат на производство. Однако, как пояснено ниже, на практике трудно измерить потребление основного капитала и не всегда можно получить удовлетворительные оценки его стоимости и, следовательно, чистой добавленной стоимости. Поэтому предусмотрена возможность измерения добавленной стоимости как на валовой, так и на чистой основе.
source: Система национальных счетов 2008
  source: https://suz.cisstat.org/xwiki/wiki/NationalAccounts/view/%D0%91%D0%B8%D0%B1%D0%BB%D0%B8%D0%BE%D1%82%D0%B5%D0%BA%D0%B0/%D0%A1%D0%B8%D1%81%D1%82%D0%B5%D0%BC%D0%B0%20%D0%BD%D0%B0%D1%86%D0%B8%D0%BE%D0%BD%…
requires: Промежуточное потребление
requires: Выпуск
term status: draft
definition: Gross value added is the value of output less the value of intermediate consumption.
definition: Валовая добавленная стоимость — стоимость выпуска минус стоимость промежуточного потребления.
in scheme: Глоссарий
preferred label: Gross Value Added
related: Потребление основного капитала
related: Чистая добавленная стоимость
related: Производство
top concept of: Глоссарий

Ценности
type: Concept
comment: Предполагается, что в течение длительного периода времени реальная стоимость ценностей увеличится или, по крайней мере, не уменьшится, и что ценности не утратят своих физических свойств при нормальных условиях. Ценности включают драгоценные металлы и камни, ювелирные изделия, произведения искусства и т. д. Ценностями могут обладать все секторы экономики.
source: Система национальных счетов 2008
  source: https://suz.cisstat.org/xwiki/wiki/NationalAccounts/view/%D0%91%D0%B8%D0%B1%D0%BB%D0%B8%D0%BE%D1%82%D0%B5%D0%BA%D0%B0/%D0%A1%D0%B8%D1%81%D1%82%D0%B5%D0%BC%D0%B0%20%D0%BD%D0%B0%D1%86%D0%B8%D0%BE%D0%BD%…
requires: Запасы
requires: Товары
term status: draft
definition: Valuables are produced goods of considerable value that are not used primarily for purposes of production or consumption but are held as stores of value over time.
definition: Ценности — это произведенные товары значительной стоимости, которые не используются преимущественно в целях производства или потребления, но хранятся в течение некоторого периода времени в качестве запасов стоимости.
in scheme: Глоссарий
preferred label: Valuables
top concept of: Глоссарий

Производство
type: Concept
comment: Счёт производства показывает выпуск произведенной продукции и различные затраты на производство.
source: Система национальных счетов 2008
  source: https://suz.cisstat.org/xwiki/wiki/NationalAccounts/view/%D0%91%D0%B8%D0%B1%D0%BB%D0%B8%D0%BE%D1%82%D0%B5%D0%BA%D0%B0/%D0%A1%D0%B8%D1%81%D1%82%D0%B5%D0%BC%D0%B0%20%D0%BD%D0%B0%D1%86%D0%B8%D0%BE%D0%BD%…
requires: Институциональная единица
requires: Услуги
requires: Товары
term status: draft
alternative label: Производственная деятельность
definition: Производство — вид деятельности, осуществляемый под ответственностью, контролем и управлением институциональной единицы, которая использует труд, капитал и товары и услуги для производства товаров и услуг.
definition: Production is an activity, carried out under the responsibility, control and management of an institutional unit, that uses inputs of labour, capital, and goods and services to produce outputs of goods and services.
in scheme: Глоссарий
preferred label: Production
related: Выпуск
related: Продукты
top concept of: Глоссарий

Цена
type: Concept
comment: Она зависит от размера единицы измерения выбранного количества и во многих случаях может меняться в зависимости от изменения единицы измерения количества, например, в связи с решением измерять количество в тоннах, а не в килограммах. Цены, как и количества, не являются аддитивными для различных товаров или услуг. Среднее значение цен различных товаров или услуг не имеет экономического смысла и не может использоваться, чтобы определить изменение цен за некоторый период времени.
source: Система национальных счетов 2008
  source: https://suz.cisstat.org/xwiki/wiki/NationalAccounts/view/%D0%91%D0%B8%D0%B1%D0%BB%D0%B8%D0%BE%D1%82%D0%B5%D0%BA%D0%B0/%D0%A1%D0%B8%D1%81%D1%82%D0%B5%D0%BC%D0%B0%20%D0%BD%D0%B0%D1%86%D0%B8%D0%BE%D0%BD%…
requires: Услуги
requires: Товары
term status: draft
definition: Цена товара или услуги определяется как стоимость единицы данного товара или услуги.
definition: The price of a good or service is defined as the value of one unit of that good or service
in scheme: Глоссарий
preferred label: Price
related: Услуги
related: Товары
top concept of: Глоссарий

Чистая добавленная стоимость
type: Concept
comment: Поскольку добавленная стоимость предназначена для измерения стоимости, созданной в процессе производства, она должна быть измерена на чистой основе, так как потребление основного капитала представляет собой статью затрат на производство.
source: Система национальных счетов 2008
  source: https://suz.cisstat.org/xwiki/wiki/NationalAccounts/view/%D0%91%D0%B8%D0%B1%D0%BB%D0%B8%D0%BE%D1%82%D0%B5%D0%BA%D0%B0/%D0%A1%D0%B8%D1%81%D1%82%D0%B5%D0%BC%D0%B0%20%D0%BD%D0%B0%D1%86%D0%B8%D0%BE%D0%BD%…
requires: Потребление основного капитала
requires: Промежуточное потребление
requires: Выпуск
term status: draft
definition: Чистая добавленная стоимость — стоимости выпуска минус стоимость промежуточного потребления и потребления основного капитала
definition: Net value added is the value of output less the values of both intermediate consumption and consumption of fixed capital.
in scheme: Глоссарий
preferred label: Net value added
related: Потребление основного капитала
related: Производство
top concept of: Глоссарий

Домашнее хозяйство
type: Concept
comment: Отдельные члены домашнего хозяйства, которое состоит из нескольких лиц, не рассматриваются как отдельные институциональные единицы. Многие активы являются собственностью двух или более членов того же самого домашнего хозяйства, и обязательства также могут приниматься несколькими членами того же самого домашнего хозяйства; в то же время доход, полученный отдельными членами того же домашнего хозяйства, может быть использован всеми членами домашнего хозяйства. Более того, многие решения по вопросу о расходах, в особенности те, которые относятся к расходам на продукты питания и оплату жилищных услуг, могут приниматься коллективно для домашнего хозяйства в целом. Поэтому может оказаться невозможным составить баланс активов и пассивов и другие счета для отдельных членов домашнего хозяйства, которые содержали бы полезную с экономической точки зрения информацию. По этой причине домашнее хозяйство в целом, а не отдельные его члены, должно рассматриваться как институциональная единица
source: Система национальных счетов 2008
  source: https://suz.cisstat.org/xwiki/wiki/NationalAccounts/view/%D0%91%D0%B8%D0%B1%D0%BB%D0%B8%D0%BE%D1%82%D0%B5%D0%BA%D0%B0/%D0%A1%D0%B8%D1%81%D1%82%D0%B5%D0%BC%D0%B0%20%D0%BD%D0%B0%D1%86%D0%B8%D0%BE%D0%BD%…
requires: Услуги
requires: Товары
requires: Продукты
term status: draft
alternative label: Домохозяйство
broader: Институциональный сектор
definition: Household is a group of persons who share the same living accommodation, who pool some, or all, of their income and wealth and who consume certain types of goods and services collectively, mainly housing and food.
definition: Домашнее хозяйство определено как группа лиц, которые живут в одном и том же жилище, объединяют частично или полностью свои доходы и имущество и потребляют коллективно некоторые виды товаров и услуг, главным образом, жилищные услуги и продукты питания.
example: Уровень и условия жизни: Рассматривает совокупность лиц, проживающих в одном жилом помещении (или его части), как связанных, так и не связанных отношениями родства. Домохозяйство может состоять и из одного человека, живущего самостоятельно и обеспечивающего себя пищей и всем необходимым для жизни.
in scheme: Глоссарий
preferred label: Household
related: Институциональная единица
related: Обязательство
related: Услуги
related: Актив
related: Продукты
top concept of: Глоссарий

Актив
type: Concept
comment: Активы могут быть финансовыми и нефинансовыми. Для большинства финансовых активов существуют корреспондирующие (финансовые) обязательства.
source: Система национальных счетов 2008
  source: https://suz.cisstat.org/xwiki/wiki/NationalAccounts/view/%D0%91%D0%B8%D0%B1%D0%BB%D0%B8%D0%BE%D1%82%D0%B5%D0%BA%D0%B0/%D0%A1%D0%B8%D1%81%D1%82%D0%B5%D0%BC%D0%B0%20%D0%BD%D0%B0%D1%86%D0%B8%D0%BE%D0%BD%…
term status: draft
broader: Запасы
definition: An asset is a store of value representing a benefit or series of benefits accruing to the economic owner by holding or using the entity over a period of time. It is a means of carrying forward value from one accounting period to another.
definition: Актив — это накопленный запас стоимости, приносящий экономическую выгоду или ряд экономических выгод экономическому собственнику актива как следствие владения им или использования его в течение некоторого периода времени. Это средство, позволяющее переносить стоимость от одного отчетного периода к другому.
in scheme: Глоссарий
preferred label: Asset
related: Обязательство
top concept of: Глоссарий

Расходы на конечное потребление
type: Concept
source: Система национальных счетов 2008
  source: https://suz.cisstat.org/xwiki/wiki/NationalAccounts/view/%D0%91%D0%B8%D0%B1%D0%BB%D0%B8%D0%BE%D1%82%D0%B5%D0%BA%D0%B0/%D0%A1%D0%B8%D1%81%D1%82%D0%B5%D0%BC%D0%B0%20%D0%BD%D0%B0%D1%86%D0%B8%D0%BE%D0%BD%…
requires: Товары
term status: draft
definition: Final consumption expenditure is the amount of expenditure on consumption goods and services.
definition: Расходы на конечное потребление — это сумма расходов на потребительские товары и услуги.
in scheme: Глоссарий
preferred label: Final Consumption Expenditure
top concept of: Глоссарий

Товары
type: Concept
comment: Индивидуальные товары и услуги, как правило, приобретаются и продаются на рынке, хотя они могут также предоставляться бесплатно или в ценах, которые не являются экономически значимыми, например, товары и услуги, предоставляемые в качестве социальных трансфертов в натуральной форме. На практике все товары и большинство услуг являются индивидуальными.
source: Система национальных счетов 2008
  source: https://suz.cisstat.org/xwiki/wiki/NationalAccounts/view/%D0%91%D0%B8%D0%B1%D0%BB%D0%B8%D0%BE%D1%82%D0%B5%D0%BA%D0%B0/%D0%A1%D0%B8%D1%81%D1%82%D0%B5%D0%BC%D0%B0%20%D0%BD%D0%B0%D1%86%D0%B8%D0%BE%D0%BD%…
requires: Институциональная единица
requires: Операция
term status: draft
broader: Продукты
definition: Goods are physical, produced objects for which a demand exists, over which ownership rights can be established and whose ownership can be transferred from one institutional unit to another by engaging in transactions on markets.
definition: Товары представляют собой материально-вещественные произведенные объекты, на которые существует спрос, и в отношении которых могут быть установлены права собственности, которые могут быть переданы от одной институциональной единицы другой путем участия в операциях на рынках.
in scheme: Глоссарий
preferred label: Goods
related: Услуги
related: Цена
top concept of: Глоссарий

Валовый внутренний продукт
type: Concept
comment: Есть три разных метода определения ВВП: а. оценка валового внутреннего продукта производственным методом; b. оценка валового внутреннего продукта <a target="_blank" rel="noopener noreferrer" href="https://suz.cisstat.org/xwiki/wiki/NationalAccounts/view/%D0%93%D0%BB%D0%BE%D1%81%D1%81%D0%B0%D1%80%D0%B8%D0%B8/%D0%92%D0%92%D0%9F%20%D0%B8%D1%81%D1%87%D0%B8%D1%81%D0%BB%D0%B5%D0%BD%D0%BD%D1%8B%D0%B9%20%D0%BC%D0%B5%D1%82%D0%BE%D0%B4%D0%BE%D0%BC%20%D0%BA%D0%BE%D0%BD%D0%B5%D1%87%D0%BD%D0%BE%D0%B3%D0%BE%20%D0%B8%D1%81%D0%BF%D0%BE%D0%BB%D1%8C%D0%B7%D0%BE%D0%B2%D0%B0%D0%BD%D0%B8%D1%8F/">методом конечного использования; с. оценка валового внутреннего продукта распределительным методом.
source: Система национальных счетов 2008
  source: https://suz.cisstat.org/xwiki/wiki/NationalAccounts/view/%D0%91%D0%B8%D0%B1%D0%BB%D0%B8%D0%BE%D1%82%D0%B5%D0%BA%D0%B0/%D0%A1%D0%B8%D1%81%D1%82%D0%B5%D0%BC%D0%B0%20%D0%BD%D0%B0%D1%86%D0%B8%D0%BE%D0%BD%…
term status: draft
alternative label: ВВП
alternative label: GDP
definition: Валовой внутренний продукт (ВВП) представляет собой конечный результат производственной деятельности резидентных единиц-производителей в течение данного периода времени и исчисляется в рыночных ценах.
in scheme: Глоссарий
preferred label: Gross Domestic Product
related: ВВП, исчисленный производственным методом
related: ВВП, исчисленный методом конечного использования
top concept of: Глоссарий

Операция
type: Concept
source: Система национальных счетов 2008
  source: https://suz.cisstat.org/xwiki/wiki/NationalAccounts/view/%D0%91%D0%B8%D0%B1%D0%BB%D0%B8%D0%BE%D1%82%D0%B5%D0%BA%D0%B0/%D0%A1%D0%B8%D1%81%D1%82%D0%B5%D0%BC%D0%B0%20%D0%BD%D0%B0%D1%86%D0%B8%D0%BE%D0%BD%…
requires: Институциональная единица
requires: Экономические потоки
term status: draft
broader: Экономические потоки
definition: A transaction is an economic flow that is an interaction between institutional units by mutual agreement or an action within an institutional unit that it is analytically useful to treat like a transaction, often because the unit is operating in two different capacities.
definition: Операция — это экономический поток, представляющий собой взаимодействие между институциональными единицами по взаимному согласию или действие в рамках одной институциональной единицы, которое с аналитической точки зрения целесообразно рассматривать как операцию, часто ввиду того, что единица функционирует в двух различных качествах.
in scheme: Глоссарий
preferred label: Transaction
top concept of: Глоссарий

Цена производителя
type: Concept
comment: Она не включает транспортные расходы, представленные отдельно в счете-фактуре производителем. Ни цена производителя, ни основная цена не включают любые величины НДС, подлежащие получению, или аналогичные вычитаемые налоги, начисленные на реализованный выпуск. В отличие от основной цены цена производителя включает налоги на продукты (налоги, подлежащие выплате на единицу выпуска) и исключает субсидии на продукты (субсидии, подлежащие получению на единицу выпуска). Цена производителя — это цена, которая не включает НДС, который производитель начисляет покупателю. Основная цена измеряет стоимость, удерживаемую производителем, и, следовательно, она является более адекватной для принятия решений производителем. Во многих странах становится общей практикой для производителей показывать различные виды налогов отдельно в их счетах-фактурах, так что покупатели информированы о том, какие налоги они платят производителю, а какие налоги — органам государственного управления.
source: Система национальных счетов 2008
  source: https://suz.cisstat.org/xwiki/wiki/NationalAccounts/view/%D0%91%D0%B8%D0%B1%D0%BB%D0%B8%D0%BE%D1%82%D0%B5%D0%BA%D0%B0/%D0%A1%D0%B8%D1%81%D1%82%D0%B5%D0%BC%D0%B0%20%D0%BD%D0%B0%D1%86%D0%B8%D0%BE%D0%BD%…
requires: Услуги
requires: Выпуск
requires: Товары
term status: draft
broader: Цена
definition: Цена производителя — это сумма, подлежащая получению производителем от покупателя за единицу товара или услуги, произведенных в качестве выпуска, минус любой начисленный НДС или аналогичный вычитаемый налог.
definition: The producer’s price is the amount receivable by the producer from the purchaser for a unit of a good or service produced as output minus any VAT, or similar deductible tax, invoiced to the purchaser. It excludes any transport charges invoiced separately by the producer.
example: Цены: Цена производителя на услугу производственного характера не включает косвенные товарные налоги – налог на добавленную стоимость (НДС), акцизы и другие налоги, не входящие в себестоимость услуги.
in scheme: Глоссарий
preferred label: Producer’s Price
related: Субсидия на продукт
related: Налог на продукт
related: Органы государственного управления
related: Выпуск
related: Цена
top concept of: Глоссарий

Финансовые корпорации
type: Concept
comment: Сектор финансовых корпораций состоит из следующей совокупности резидентских институциональных единиц: все резидентские финансовые корпорации (как они понимаются в СНС, а не только корпорации, учрежденные как юридические лица) независимо от резидентства их акционеров; филиалы нерезидентских предприятий, которые заняты финансовой деятельностью на экономической территории данной страны в течение длительного периода времени; все резидентские НКО, которые являются рыночными производителями финансовых услуг.
requires: Корпорация
requires: Институциональная единица
term status: draft
broader: Институциональный сектор
definition: Финансовые корпорации включают все резидентские корпорации, которые в основном заняты предоставлением финансовых услуг другим институциональным единицам, в том числе услуг страхования и пенсионных фондов.
definition: Financial corporations consist of all resident corporations that are principally engaged in providing financial services, including insurance and pension funding services, to other institutional units.
in scheme: Глоссарий
preferred label: Financial corporations
related: Резидентство
related: Корпорация
related: Институциональная единица
related: Некоммерческие организации
related: Юридическое лицо
related: Предприятие
top concept of: Глоссарий

Экономические потоки
type: Concept
comment: Отражая разнообразие в экономике, экономические потоки имеют конкретный вид, такой как оплата труда, налоги, проценты, потоки капитала и так далее, которые отражают способы, с помощью которых происходят изменения в активах и обязательствах единицы.
source: Система национальных счетов 2008
  source: https://suz.cisstat.org/xwiki/wiki/NationalAccounts/view/%D0%91%D0%B8%D0%B1%D0%BB%D0%B8%D0%BE%D1%82%D0%B5%D0%BA%D0%B0/%D0%A1%D0%B8%D1%81%D1%82%D0%B5%D0%BC%D0%B0%20%D0%BD%D0%B0%D1%86%D0%B8%D0%BE%D0%BD%…
requires: Институциональная единица
requires: Обязательство
requires: Актив
term status: draft
definition: Economic flows reflect the creation, transformation, exchange, transfer or extinction of economic value; they involve changes in the volume, composition, or value of an institutional unit’s assets and liabilities.
definition: Экономические потоки отражают создание, трансформацию, обмен, трансферт или исчезновение экономической стоимости. Они предполагают изменения в объеме, структуре или стоимости активов и обязательств институциональной единицы.
in scheme: Глоссарий
preferred label: Economic flows
related: Обязательство
related: Актив
top concept of: Глоссарий

Валовой национальный располагаемый доход
type: Concept
source: Система национальных счетов 2008
  source: https://suz.cisstat.org/xwiki/wiki/NationalAccounts/view/%D0%91%D0%B8%D0%B1%D0%BB%D0%B8%D0%BE%D1%82%D0%B5%D0%BA%D0%B0/%D0%A1%D0%B8%D1%81%D1%82%D0%B5%D0%BC%D0%B0%20%D0%BD%D0%B0%D1%86%D0%B8%D0%BE%D0%BD%…
term status: draft
definition: Валовой (чистый) национальный располагаемый доход может быть получен путем добавления к валовому или чистому национальному доходу всех текущих трансфертов в денежной или натуральной форме, подлежащих получению институциональными единицами — резидентами данной страны от нерезидентов, и вычитания всех текущих трансфертов в денежной или натуральной форме, подлежащих выплате институциональными единицами — резидентами данной страны нерезидентам.
definition: Gross or net national disposable income may be derived from gross or net national income by adding all current transfers in cash or in kind receivable by resident institutional units from non-resident units; and subtracting all current transfers in cash or in kind payable by resident institutional units to non-resident units.
in scheme: Глоссарий
preferred label: Gross or Net National Disposable Income
top concept of: Глоссарий

ВВП, исчисленный производственным методом
type: Concept
comment: Оценка ВВП производственным методом может быть также представлена как добавленная стоимость, скорректированная таким образом, чтобы обеспечить включение всех налогов на продукты за вычетом субсидий на продукты.
comment: The production measure of GDP can also be expressed as value added adjusted to ensure all taxes less subsidies on products are included.
source: Система национальных счетов 2008
  source: https://suz.cisstat.org/xwiki/wiki/NationalAccounts/view/%D0%91%D0%B8%D0%B1%D0%BB%D0%B8%D0%BE%D1%82%D0%B5%D0%BA%D0%B0/%D0%A1%D0%B8%D1%81%D1%82%D0%B5%D0%BC%D0%B0%20%D0%BD%D0%B0%D1%86%D0%B8%D0%BE%D0%BD%…
term status: draft
broader: Валовый внутренний продукт
definition: Оценка валового внутреннего продукта (ВВП) производственным методом получается как стоимость выпуска, минус промежуточное потребление, плюс любые налоги на продукты за вычетом субсидий на продукты, кроме тех, которые уже включены в стоимость выпуска.
definition: The production measure of gross domestic product (GDP) is derived as the value of output less intermediate consumption plus any taxes less subsidies on products not already included in the value of output.
in scheme: Глоссарий
preferred label: Production Measure of Gross Domestic Product
top concept of: Глоссарий

Вторичная деятельность
type: Concept
comment: Величина добавленной стоимости, созданная в процессе вторичной деятельности, должна быть меньше добавленной стоимости основной деятельности. Выпуск, произведенный в результате вторичной деятельности, называется вторичным продуктом. Большинство производственных единиц выпускают, по крайней мере, некоторые вторичные продукты.
source: Система национальных счетов 2008
  source: https://suz.cisstat.org/xwiki/wiki/NationalAccounts/view/%D0%91%D0%B8%D0%B1%D0%BB%D0%B8%D0%BE%D1%82%D0%B5%D0%BA%D0%B0/%D0%A1%D0%B8%D1%81%D1%82%D0%B5%D0%BC%D0%B0%20%D0%BD%D0%B0%D1%86%D0%B8%D0%BE%D0%BD%…
requires: Выпуск
term status: draft
broader: Производство
definition: Вторичная деятельность — это деятельность, осуществляемая внутри производственной единицы наряду с основной деятельностью, и чей выпуск, подобно выпуску основной деятельности, должен быть пригоден для поставки за пределы этой производственной единицы.
definition: A secondary activity is an activity carried out within a single producer unit in addition to the principal activity and whose output, like that of the principal activity, must be suitable for delivery outside the producer unit.
in scheme: Глоссарий
preferred label: Secondary Activity
related: Выпуск
related: Продукты
top concept of: Глоссарий

Первичные доходы
type: Concept
comment: Основной статьей первичных доходов является оплата труда, которая представляет собой доход, получаемый отдельными лицами в качестве вознаграждения за их затраты труда в процессе производства.
source: Система национальных счетов 2008
  source: https://suz.cisstat.org/xwiki/wiki/NationalAccounts/view/%D0%91%D0%B8%D0%B1%D0%BB%D0%B8%D0%BE%D1%82%D0%B5%D0%BA%D0%B0/%D0%A1%D0%B8%D1%81%D1%82%D0%B5%D0%BC%D0%B0%20%D0%BD%D0%B0%D1%86%D0%B8%D0%BE%D0%BD%…
requires: Институциональная единица
requires: Актив
term status: draft
definition: Первичные доходы — это доходы, получаемые институциональными единицами в результате их участия в производственных процессах или владения активами, которые могут использоваться для целей производства.
definition: Primary incomes are incomes that accrue to institutional units as a consequence of their involvement in processes of production or ownership of assets that may be needed for purposes of production.
in scheme: Глоссарий
preferred label: Primary Incomes
top concept of: Глоссарий

Корпорация
type: Concept
comment: Корпорации могут быть резидентами стран, отличных от стран резидентства их акционеров, и дочерние корпорации могут иметь резидентство в странах, отличных от резидентства материнской корпорации.
requires: Юридическое лицо
term status: draft
broader: Институциональная единица
definition: Термин «корпорация» охватывает корпорации, учрежденные как юридические лица, а также кооперативы, партнерства с ограниченной ответственностью, условные резидентские единицы и квазикорпорации.
definition: The term corporation covers legally constituted corporations and also cooperatives, limited liability partnerships, notional resident units and quasi-corporations.
in scheme: Глоссарий
preferred label: Corporation
related: Резидентство
top concept of: Глоссарий

Субсидия на продукт
type: Concept
comment: Субсидия может быть конкретной денежной суммой на единицу количества товара или услуги, либо она может рассчитываться как определенный процент от общей стоимости или цены единицы продукта. Размер субсидии можно также вычислить как разницу между конкретной целевой ценой и рыночной ценой, фактически уплаченной покупателем. Обычно субсидия на продукт подлежит выплате, когда товар или услуга произведены, проданы или импортированы. Кроме того, субсидия может подлежать выплате в других обстоятельствах (напри мер, когда происходит трансферт, аренда, поставка или использование товара для собственного потребления или накопления.
source: Система национальных счетов 2008
  source: https://suz.cisstat.org/xwiki/wiki/NationalAccounts/view/%D0%91%D0%B8%D0%B1%D0%BB%D0%B8%D0%BE%D1%82%D0%B5%D0%BA%D0%B0/%D0%A1%D0%B8%D1%81%D1%82%D0%B5%D0%BC%D0%B0%20%D0%BD%D0%B0%D1%86%D0%B8%D0%BE%D0%BD%…
requires: Товары
term status: draft
definition: Субсидия на продукт — это субсидия, выплачиваемая за единицу товара или услуги.
definition: A subsidy on a product is a subsidy payable per unit of a good or service.
in scheme: Глоссарий
preferred label: Subsidy On Product
top concept of: Глоссарий

Юридическое лицо
type: Concept
comment: Такие единицы ответственны или подотчетны за экономические решения или действия, которые они предпринимают, хотя их автономность может быть ограничена в некоторой степени другими институциональными единицами; например, корпорации в конечном итоге контролируются их акционерами. Поведение некоторых некорпорированных предприятий, принадлежащих домашним хозяйствам или органам государственного управления, аналогично поведению корпораций, и поэтому такие предприятия рассматриваются как квазикорпорации, если у них есть полный набор счетов.
term status: draft
alternative label: Social entity
alternative label: Общественная организация
broader: Институциональная единица
definition: Юридическое лицо или общественная организация — это такая единица, существование которой признано законом или обществом, независимо от физических лиц или других юридических единиц, которые, возможно, являются их собственниками или контролируют их.
definition: A legal or social entity is one whose existence is recognized by law or society independently of the persons, or other entities, that may own or control it.
in scheme: Глоссарий
preferred label: Legal entity
related: Институциональная единица
related: Домашнее хозяйство
related: Предприятие
top concept of: Глоссарий

Местная единица
type: Concept
comment: Такое определение «местной единицы» отражает только один аспект, так как оно не соотносится с видом выполняемой деятельности. Место размещения можно определять по-разному в зависимости от цели: например, в узком смысле — это конкретный адрес, а в более широком — местность в пределах провинции, штата, графства и т.д.
source: Система национальных счетов 2008
  source: https://suz.cisstat.org/xwiki/wiki/NationalAccounts/view/%D0%91%D0%B8%D0%B1%D0%BB%D0%B8%D0%BE%D1%82%D0%B5%D0%BA%D0%B0/%D0%A1%D0%B8%D1%81%D1%82%D0%B5%D0%BC%D0%B0%20%D0%BD%D0%B0%D1%86%D0%B8%D0%BE%D0%BD%…
requires: Производство
requires: Предприятие
term status: draft
alternative label: Территориально-обособленное подразделение
broader: Предприятие
definition: Местная единица — это предприятие или часть предприятия, занимающиеся производственной деятельностью в одном месте или из одного места.
definition: A local unit is an enterprise, or a part of an enterprise, that engages in productive activity at or from one location.
in scheme: Глоссарий
preferred label: Local Unit
top concept of: Глоссарий

Изменение запасов материальных оборотных средств
type: Concept
comment: Некоторые из этих поступлений и выбытий относятся к фактическим покупкам или продажам, но другие отражают операции, которые происходят внутри предприятия.
comment: Some of these acquisitions and disposals are attributable to actual purchases or sales, but others reflect transactions that are internal to the enterprise.
source: Система национальных счетов 2008
  source: https://suz.cisstat.org/xwiki/wiki/NationalAccounts/view/%D0%91%D0%B8%D0%B1%D0%BB%D0%B8%D0%BE%D1%82%D0%B5%D0%BA%D0%B0/%D0%A1%D0%B8%D1%81%D1%82%D0%B5%D0%BC%D0%B0%20%D0%BD%D0%B0%D1%86%D0%B8%D0%BE%D0%BD%…
term status: draft
definition: Изменение запасов материальных оборотных средств определяется как стоимость поступлений в запасы материальных оборотных средств за вычетом стоимости выбытий из запасов и за вычетом стоимости любых текущих потерь товаров, которые находились в запасах материальных оборотных средств, в течение отчетного периода.
definition: Changes in inventories are measured by the value of the entries into inventories less the value of withdrawals and less the value of any recurrent losses of goods held in inventories during the accounting period.
in scheme: Глоссарий
preferred label: Changes in Inventories
top concept of: Глоссарий

Финансовые активы
type: Concept
source: Система национальных счетов 2008
  source: https://suz.cisstat.org/xwiki/wiki/NationalAccounts/view/%D0%91%D0%B8%D0%B1%D0%BB%D0%B8%D0%BE%D1%82%D0%B5%D0%BA%D0%B0/%D0%A1%D0%B8%D1%81%D1%82%D0%B5%D0%BC%D0%B0%20%D0%BD%D0%B0%D1%86%D0%B8%D0%BE%D0%BD%…
requires: Актив
term status: draft
broader: Актив
definition: Financial assets consist of all financial claims, shares or other equity in corporations plus gold bullion held by monetary authorities as a reserve asset.
definition: Финансовые активы включают все финансовые требования, акции или другие виды участия в капитале корпораций плюс золото в слитках, держателями которого в качестве резервного актива являются органы денежно-кредитного регулирования.
in scheme: Глоссарий
preferred label: Financial assets
top concept of: Глоссарий

Предприятие
type: Concept
comment: Термин «предприятие» может относиться к корпорации, квазикорпорации, некоммерческой организации или некорпорированному предприятию. Поскольку корпорации и НКО, за исключением <a target="_blank" rel="noopener noreferrer" href="https://suz.cisstat.org/xwiki/wiki/NationalAccounts/view/%D0%93%D0%BB%D0%BE%D1%81%D1%81%D0%B0%D1%80%D0%B8%D0%B8/%D0%9D%D0%B5%D0%BA%D0%BE%D0%BC%D0%BC%D0%B5%D1%80%D1%87%D0%B5%D1%81%D0%BA%D0%B8%D0%B5%20%D0%BE%D1%80%D0%B3%D0%B0%D0%BD%D0%B8%D0%B7%D0%B0%D1%86%D0%B8%D0%B8%2C%20%D0%BE%D0%B1%D1%81%D0%BB%D1%83%D0%B6%D0%B8%D0%B2%D0%B0%D1%8E%D1%89%D0%B8%D0%B5%20%D0%B4%D0%BE%D0%BC%D0%B0%D1%88%D0%BD%D0%B8%D0%B5%20%D1%85%D0%BE%D0%B7%D1%8F%D0%B9%D1%81%D1%82%D0%B2%D0%B0/">НКОДХ, главным образом, создаются для осуществления производственной деятельности, вся информация о них, отражаемая в счетах, относится к производству и связанной с ним деятельности по накоплению. Органы государственного управления, домашние хозяйства и <a target="_blank" rel="noopener noreferrer" href="https://suz.cisstat.org/xwiki/wiki/NationalAccounts/view/%D0%93%D0%BB%D0%BE%D1%81%D1%81%D0%B0%D1%80%D0%B8%D0%B8/%D0%9D%D0%B5%D0%BA%D0%BE%D0%BC%D0%BC%D0%B5%D1%80%D1%87%D0%B5%D1%81%D0%BA%D0%B8%D0%B5%20%D0%BE%D1%80%D0%B3%D0%B0%D0%BD%D0%B8%D0%B7%D0%B0%D1%86%D0%B8%D0%B8%2C%20%D0%BE%D0%B1%D1%81%D0%BB%D1%83%D0%B6%D0%B8%D0%B2%D0%B0%D1%8E%D1%89%D0%B8%D0%B5%20%D0%B4%D0%BE%D0%BC%D0%B0%D1%88%D0%BD%D0%B8%D0%B5%20%D1%85%D0%BE%D0%B7%D1%8F%D0%B9%D1%81%D1%82%D0%B2%D0%B0/">НКОДХ безусловно осуществляют операции, связанные с конечным потреблением, но они могут также заниматься производственной деятельностью; в действительности, органы государственного управления и <a target="_blank" rel="noopener noreferrer" href="https://suz.cisstat.org/xwiki/wiki/NationalAccounts/view/%D0%93%D0%BB%D0%BE%D1%81%D1%81%D0%B0%D1%80%D0%B8%D0%B8/%D0%9D%D0%B5%D0%BA%D0%BE%D0%BC%D0%BC%D0%B5%D1%80%D1%87%D0%B5%D1%81%D0%BA%D0%B8%D0%B5%20%D0%BE%D1%80%D0%B3%D0%B0%D0%BD%D0%B8%D0%B7%D0%B0%D1%86%D0%B8%D0%B8%2C%20%D0%BE%D0%B1%D1%81%D0%BB%D1%83%D0…
source: Система национальных счетов 2008
  source: https://suz.cisstat.org/xwiki/wiki/NationalAccounts/view/%D0%91%D0%B8%D0%B1%D0%BB%D0%B8%D0%BE%D1%82%D0%B5%D0%BA%D0%B0/%D0%A1%D0%B8%D1%81%D1%82%D0%B5%D0%BC%D0%B0%20%D0%BD%D0%B0%D1%86%D0%B8%D0%BE%D0%BD%…
requires: Институциональная единица
requires: Услуги
requires: Товары
term status: draft
broader: Институциональная единица
definition: An enterprise is the view of an institutional unit as a producer of goods and services.
definition: Предприятие — институциональная единица, являющаяся производителем товаров и услуг.
in scheme: Глоссарий
preferred label: Enterprise
related: Некоммерческие организации, обслуживающие домашние хозяйства
related: Корпорация
related: Некоммерческие организации
related: Производство
related: Потребление
related: Домашнее хозяйство
related: Операция
related: Органы государственного управления
top concept of: Глоссарий

Обязательство
type: Concept
source: Система национальных счетов 2008
  source: https://suz.cisstat.org/xwiki/wiki/NationalAccounts/view/%D0%91%D0%B8%D0%B1%D0%BB%D0%B8%D0%BE%D1%82%D0%B5%D0%BA%D0%B0/%D0%A1%D0%B8%D1%81%D1%82%D0%B5%D0%BC%D0%B0%20%D0%BD%D0%B0%D1%86%D0%B8%D0%BE%D0%BD%…
term status: draft
definition: Обязательство возникает, когда одна единица (дебитор) обязуется при определенных обстоятельствах произвести платеж или ряд платежей другой единице (кредитору).
definition: A liability is established when one unit (the debtor) is obliged, under specific circumstances, to provide a payment or series of payments to another unit (the creditor).
in scheme: Глоссарий
preferred label: Liability
top concept of: Глоссарий

Налоги на производство, подлежащие выплате
type: Concept
source: Система национальных счетов 2008
  source: https://suz.cisstat.org/xwiki/wiki/NationalAccounts/view/%D0%91%D0%B8%D0%B1%D0%BB%D0%B8%D0%BE%D1%82%D0%B5%D0%BA%D0%B0/%D0%A1%D0%B8%D1%81%D1%82%D0%B5%D0%BC%D0%B0%20%D0%BD%D0%B0%D1%86%D0%B8%D0%BE%D0%BD%…
term status: draft
definition: Налоги на производство, подлежащие выплате, включают налоги на продукты, производимые в качестве выпуска, а также другие налоги на производство в связи с использованием в производстве рабочей силы, машин, оборудования и других активов.
definition: Taxes less subsidies on production consist of taxes payable or subsidies receivable on goods or services produced as outputs and other taxes or subsidies on production, such as those payable on the labour, machinery, buildings or other assets used in production.
in scheme: Глоссарий
preferred label: Taxes Less Subsidies on Production
top concept of: Глоссарий

Потребление
type: Concept
comment: Удовлетворение потребностей или желаний человека является немедленным и прямым в случае конечного потребления; оно является косвенным и отложенным в случае промежуточного потребления, в процессе которого товары и услуги используются, чтобы произвести другие товары и услуги, которые в конечном счете обеспечивают удовлетворение потребностей или желаний человека.
comment: The activity of consumption consists of the use of goods and services for the satisfaction of individual or collective human needs or wants
source: Система национальных счетов 2008
  source: https://suz.cisstat.org/xwiki/wiki/NationalAccounts/view/%D0%91%D0%B8%D0%B1%D0%BB%D0%B8%D0%BE%D1%82%D0%B5%D0%BA%D0%B0/%D0%A1%D0%B8%D1%81%D1%82%D0%B5%D0%BC%D0%B0%20%D0%BD%D0%B0%D1%86%D0%B8%D0%BE%D0%BD%…
requires: Услуги
requires: Товары
term status: draft
definition: Деятельность, связанная с потреблением, состоит из использования товаров и услуг для удовлетворения индивидуальных или коллективных потребностей или желаний человека.
in scheme: Глоссарий
preferred label: Consumption
related: Промежуточное потребление
related: Услуги
related: Товары
top concept of: Глоссарий

Оплата труда
type: Concept
source: Система национальных счетов 2008
  source: https://suz.cisstat.org/xwiki/wiki/NationalAccounts/view/%D0%91%D0%B8%D0%B1%D0%BB%D0%B8%D0%BE%D1%82%D0%B5%D0%BA%D0%B0/%D0%A1%D0%B8%D1%81%D1%82%D0%B5%D0%BC%D0%B0%20%D0%BD%D0%B0%D1%86%D0%B8%D0%BE%D0%BD%…
term status: draft
broader: Первичные доходы
definition: Оплата труда лиц, работающих по найму, определяется как общая сумма вознаграждения в денежной или в натуральной форме, подлежащая выплате предприятием работнику за проделанную им работу в течение отчетного периода.
definition: Compensation of employees is defined as the total remuneration, in cash or in kind, payable by an enterprise to an employee in return for work done by the latter during the accounting period.
in scheme: Глоссарий
preferred label: Compensation of Employees
top concept of: Глоссарий

Балансирующая статья
type: Concept
comment: Балансирующая статья имеется также в балансе активов и пассивов, где она представляет собой разницу между активами и обязательствами и называется чистой стоимостью капитала.
source: Система национальных счетов 2008
  source: https://suz.cisstat.org/xwiki/wiki/NationalAccounts/view/%D0%91%D0%B8%D0%B1%D0%BB%D0%B8%D0%BE%D1%82%D0%B5%D0%BA%D0%B0/%D0%A1%D0%B8%D1%81%D1%82%D0%B5%D0%BC%D0%B0%20%D0%BD%D0%B0%D1%86%D0%B8%D0%BE%D0%BD%…
term status: draft
definition: A balancing item is an accounting construct obtained by subtracting the total value of the entries on one side of an account (resources or changes in liabilities) from the total value of the entries on the other side (uses or changes in assets). It cannot be measured independently of the entries in the accounts; as a derived entry, it reflects the application of the general accounting rules to the specific entries on the two sides of the account.
definition: Балансирующая статья — это конструкция национального счетоводства, получаемая путем вычитания из общей суммы записей на одной стороне счета (ресурсы или изменения в обязательствах) общей суммы записей на другой стороне (использование или изменения в активах). Она не может быть измерена независимо от записей в счетах; полученная балансовым методом (сальдированием), она отражает применение общих правил ведения счетов к конкретным записям на двух сторонах счета.
in scheme: Глоссарий
preferred label: Balancing item
top concept of: Глоссарий

Валовой национальный доход
type: Concept
comment: Валовой национальный доход (ВНД) определяется как ВВП, плюс оплата труда, подлежащая получению из-за границы, плюс доходы от собственности, подлежащие получению из-за границы, плюс налоги на производство и импорт за вычетом субсидий, подлежащие получению из-за границы, минус оплата труда, подлежащая выплате за границу, минус доходы от собственности, подлежащие выплате за границу, и минус налоги на производство и импорт за вычетом субсидий, подлежащие выплате за границу.
comment: Gross national income (GNI) is defined as GDP plus compensation of employees receivable from abroad plus property income receivable from abroad plus taxes less subsidies on production receivable from abroad less compensation of employees payable abroad less property income payable abroad and less taxes plus subsidies on production payable abroad.
source: Система национальных счетов 2008
  source: https://suz.cisstat.org/xwiki/wiki/NationalAccounts/view/%D0%91%D0%B8%D0%B1%D0%BB%D0%B8%D0%BE%D1%82%D0%B5%D0%BA%D0%B0/%D0%A1%D0%B8%D1%81%D1%82%D0%B5%D0%BC%D0%B0%20%D0%BD%D0%B0%D1%86%D0%B8%D0%BE%D0%BD%…
term status: draft
alternative label: ВНД
alternative label: GNI
definition: Валовой национальный доход — это общая сумма валовых сальдо первичных доходов всех секторов экономики.
definition: Gross national income is the aggregate value of the gross balances of primary incomes for all sectors.
in scheme: Глоссарий
preferred label: Gross National Income
top concept of: Глоссарий

Институциональная единица
type: Concept
comment: Главные характеристики институциональных единиц могут быть описаны следующим образом: Институциональная единица имеет право владеть товарами и активами от своего имени; она, следовательно, может обмениваться товарами и активами в операциях с другими институциональными единицами; Она может принимать экономические решения и участвовать в экономической деятельности, за которую она несет прямую ответственность и подотчетна по закону; Она способна принимать обязательства от своего имени, принимать обязательства другого рода и обязательства, связанные с будущей деятельностью, и заключать контракты; Институциональная единица должна иметь полный набор счетов, включая баланс активов и пассивов, или должна существовать возможность составить содержательный с экономической точки зрения набор счетов, если они потребуются.
term status: draft
definition: An institutional unit is an economic entity that is capable, in its own right, of owning assets, incurring liabilities and engaging in economic activities and in transactions with other entities.
definition: Институциональная единица — это экономическая единица, которая способна от своего имени владеть активами, принимать обязательства, участвовать в экономической деятельности и вступать в операции с другими единицами.
in scheme: Глоссарий
preferred label: Institutional unit
top concept of: Глоссарий

Глоссарий
type: ConceptScheme
comment: При разработке глоссария использовались результаты анализа документов и материалов, внешних источников, словарей и энциклопедий по разделу, а также результаты гармонизации понятий.
version info: 24.1
definition: Глоссарий представляет собой словарь узкоспециализированных терминов раздела и формируется на основе анализа методологических документов, толковых словарей и энциклопедий в области статистики национальных счетов. Глоссарий реализован как совокупность концептов, имеющих толкование (лексическое отражение), с поддержкой мультиязычности, комментариев и примеров, а также семантических отношений между концептами.
has top concept: Балансирующая статья
has top concept: Резидентство
has top concept: Валовой национальный доход
has top concept: Институциональная единица
has top concept: Остальной мир
has top concept: Денежная операция
has top concept: Запасы
has top concept: Нефинансовые корпорации
has top concept: Валовая добавленная стоимость
has top concept: Продукты
has top concept: Институциональный сектор
has top concept: Неденежные операции
has top concept: Ценности
has top concept: Цена покупателя
has top concept: Производство
has top concept: Цена
has top concept: Чистая добавленная стоимость
has top concept: Вспомогательная деятельность
has top concept: Некоммерческие организации
has top concept: Домашнее хозяйство
has top concept: Услуги
has top concept: Актив
has top concept: Расходы на конечное потребление
has top concept: Выпуск
has top concept: Товары
has top concept: Налог на продукт
has top concept: Единица вида деятельности
has top concept: Валовый внутренний продукт
has top concept: Операция
has top concept: Цена производителя
has top concept: Потребительские товары и услуги
has top concept: Валовое накопление основного капитала
has top concept: Финансовые корпорации
has top concept: Экономические потоки
has top concept: ВВП, исчисленный производственным методом
has top concept: Валовой национальный располагаемый доход
has top concept: Первичные доходы
has top concept: Вторичная деятельность
has top concept: Основная деятельность
has top concept: ВВП, исчисленный методом конечного использования
has top concept: Другие потоки
has top concept: Некоммерческие организации, обслуживающие домашние хозяйства
has top concept: Корпорация
has top concept: Субсидия на продукт
has top concept: Юридическое лицо
has top concept: Местная единица
has top concept: Капитальные трансферты
has top concept: Промежуточное потребление
has top concept: Изменение запасов материальных оборотных средств
has top concept: Финансовые активы
has top concept: Органы государственного управления
has top concept: Предприятие
has top concept: Чистое кредитование
has top concept: Товар длительного пользования
has top concept: Потребление основного капитала
has top concept: Обязательство
has top concept: Заведение
has top concept: Налоги на производство, подлежащие выплате
has top concept: Потребление
has top concept: Оплата труда
has top concept: Текущий трансферт
has top concept: Расходы на конечное потребление домашних хозяйств

Денежная операция
type: Concept
comment: В СНС все потоки отражаются в денежной форме, но отличительной характеристикой денежной операции является то, что стороны операции формулируют их соглашение в денежной форме. Например, товар приобретается или продается за определенное число денежных единиц за единицу товара или труд предоставляется по найму за определенное количество денежных единиц в расчете за час или день.
source: Система национальных счетов 2008
  source: https://suz.cisstat.org/xwiki/wiki/NationalAccounts/view/%D0%91%D0%B8%D0%B1%D0%BB%D0%B8%D0%BE%D1%82%D0%B5%D0%BA%D0%B0/%D0%A1%D0%B8%D1%81%D1%82%D0%B5%D0%BC%D0%B0%20%D0%BD%D0%B0%D1%86%D0%B8%D0%BE%D0%BD%…
requires: Институциональная единица
requires: Обязательство
requires: Актив
term status: draft
broader: Операция
definition: A monetary transaction is one in which one institutional unit makes a payment (receives a payment) or incurs a liability (receives an asset) stated in units of currency.
definition: Денежная операция — это такая операция, в которой одна институциональная единица производит платеж (получает платеж) или принимает обязательство (приобретает актив), выраженная в денежных единицах.
in scheme: Глоссарий
preferred label: Monetary transaction
top concept of: Глоссарий

Запасы
type: Concept
comment: СНС регистрирует запасы в счетах, которые обычно называются балансами активов и пассивов, составляемых на начало и конец отчетного периода. Однако запасы связаны с потоками: они являются результатом накопления от предыдущих операций и других потоков, и они изменяются в результате операций и других потоков в данном периоде. Они являются результатом непрерывных добавлений к запасам и изъятий из них и некоторых изменений в объеме или стоимости, происходящих в течение периода, пока данный актив или обязательство находятся в запасах.
source: Система национальных счетов 2008
  source: https://suz.cisstat.org/xwiki/wiki/NationalAccounts/view/%D0%91%D0%B8%D0%B1%D0%BB%D0%B8%D0%BE%D1%82%D0%B5%D0%BA%D0%B0/%D0%A1%D0%B8%D1%81%D1%82%D0%B5%D0%BC%D0%B0%20%D0%BD%D0%B0%D1%86%D0%B8%D0%BE%D0%BD%…
requires: Обязательство
requires: Актив
term status: draft
definition: Запасы — это наличие активов или обязательств на тот или иной момент времени.
definition: Stocks are a position in, or holdings of, assets and liabilities at a point in time.
in scheme: Глоссарий
preferred label: Stocks
related: Обязательство
related: Операция
related: Актив
related: Другие потоки
top concept of: Глоссарий

Нефинансовые корпорации
type: Concept
comment: Сектор нефинансовых корпораций состоит из следующей совокупности резидентских институциональных единиц: все резидентские нефинансовые корпорации (как они определены в СНС, а не только корпорации, учрежденные как юридические лица) независимо от резидентства их акционеров; филиалы нерезидентских предприятий, которые заняты нефинансовой производственной деятельностью на экономической территории данной страны в течение длительного периода времени; все резидентские НКО, которые являются рыночными производителями товаров или нефинансовых услуг.
requires: Корпорация
term status: draft
broader: Институциональный сектор
definition: Non-financial corporations are corporations whose principal activity is the production of market goods or non-financial services.
definition: Нефинансовые корпорации — это корпорации, основным видом деятельности которых является производство рыночных товаров или нефинансовых услуг.
in scheme: Глоссарий
preferred label: Non-financial corporations
related: Корпорация
related: Институциональная единица
related: Юридическое лицо
related: Некоммерческие организации
related: Предприятие
top concept of: Глоссарий

Продукты
type: Concept
source: Система национальных счетов 2008
  source: https://suz.cisstat.org/xwiki/wiki/NationalAccounts/view/%D0%91%D0%B8%D0%B1%D0%BB%D0%B8%D0%BE%D1%82%D0%B5%D0%BA%D0%B0/%D0%A1%D0%B8%D1%81%D1%82%D0%B5%D0%BC%D0%B0%20%D0%BD%D0%B0%D1%86%D0%B8%D0%BE%D0%BD%…
requires: Производство
requires: Запасы
requires: Услуги
requires: Товары
term status: draft
alternative label: Продукция
definition: Продукты — это товары и услуги (включая продукты, содержащие запас знаний), которые являются результатом производства.
definition: Products are goods and services (including knowledge-capturing products) that result from a process of production.
in scheme: Глоссарий
preferred label: Products
top concept of: Глоссарий

Институциональный сектор
type: Concept
comment: Все институциональные единицы относятся к одному и только к одному из следующих пяти институциональных секторов: сектор нефинансовых корпораций; сектор финансовых корпораций; сектор государственного управления; сектор <a target="_blank" rel="noopener noreferrer" href="https://suz.cisstat.org/xwiki/wiki/NationalAccounts/view/%D0%93%D0%BB%D0%BE%D1%81%D1%81%D0%B0%D1%80%D0%B8%D0%B8/%D0%9D%D0%B5%D0%BA%D0%BE%D0%BC%D0%BC%D0%B5%D1%80%D1%87%D0%B5%D1%81%D0%BA%D0%B8%D0%B5%20%D0%BE%D1%80%D0%B3%D0%B0%D0%BD%D0%B8%D0%B7%D0%B0%D1%86%D0%B8%D0%B8%2C%20%D0%BE%D0%B1%D1%81%D0%BB%D1%83%D0%B6%D0%B8%D0%B2%D0%B0%D1%8E%D1%89%D0%B8%D0%B5%20%D0%B4%D0%BE%D0%BC%D0%B0%D1%88%D0%BD%D0%B8%D0%B5%20%D1%85%D0%BE%D0%B7%D1%8F%D0%B9%D1%81%D1%82%D0%B2%D0%B0/">некоммерческих организаций, обслуживающих домашние хозяйства; сектор домашних хозяйств.
source:
  source: https://suz.cisstat.org/xwiki/wiki/NationalAccounts/view/%D0%93%D0%B0%D1%80%D0%BC%D0%BE%D0%BD%D0%B8%D0%B7%D0%B0%D1%86%D0%B8%D1%8F/%D0%93%D0%B0%D1%80%D0%BC%D0%BE%D0%BD%D0%B8%D0%B7%D0%B0%D1%86%D0%B8%D1%…
requires: Институциональная единица
term status: draft
broader: Институциональная единица
definition: An institutional unit is an economic entity that is capable, in its own right, of owning assets, incurring liabilities and engaging in economic activities and in transactions with other entities.
definition: Институциональный сектор – совокупность институциональных единиц, однородных с точки зрения их функций в экономике и источников финансирования, обуславливающих их сходное экономическое поведение.
in scheme: Глоссарий
preferred label: Institutional sector
related: Некоммерческие организации, обслуживающие домашние хозяйства
related: Финансовые корпорации
related: Институциональная единица
related: Домашнее хозяйство
related: Органы государственного управления
related: Нефинансовые корпорации
top concept of: Глоссарий

Неденежные операции
type: Concept
source: Система национальных счетов 2008
  source: https://suz.cisstat.org/xwiki/wiki/NationalAccounts/view/%D0%91%D0%B8%D0%B1%D0%BB%D0%B8%D0%BE%D1%82%D0%B5%D0%BA%D0%B0/%D0%A1%D0%B8%D1%81%D1%82%D0%B5%D0%BC%D0%B0%20%D0%BD%D0%B0%D1%86%D0%B8%D0%BE%D0%BD%…
requires: Операция
term status: draft
broader: Операция
definition: Non-monetary transactions are transactions that are not initially stated in units of currency.
definition: Неденежные операции — это операции, которые изначально не выражены в денежных единицах.
in scheme: Глоссарий
preferred label: Non-monetary transactions
top concept of: Глоссарий

Цена покупателя
type: Concept
comment: Если покупатель приобретает товар непосредственно у производителя, цена покупателя может превышать цену производителя на: a. сумму любого невычитаемого НДС, подлежащего уплате покупателем; и b. стоимость любых транспортных расходов на товар, оплаченных отдельно покупателем и не включенных в цену производителя. Из этого следует, что цена покупателя может превышать основную цену на величину двух упомянутых выше статей плюс стоимость любых налогов на продукты (за вычетом субсидий на продукты), кроме НДС.
source: Система национальных счетов 2008
  source: https://suz.cisstat.org/xwiki/wiki/NationalAccounts/view/%D0%91%D0%B8%D0%B1%D0%BB%D0%B8%D0%BE%D1%82%D0%B5%D0%BA%D0%B0/%D0%A1%D0%B8%D1%81%D1%82%D0%B5%D0%BC%D0%B0%20%D0%BD%D0%B0%D1%86%D0%B8%D0%BE%D0%BD%…
requires: Товары
term status: draft
broader: Цена
definition: The purchaser’s price is the amount paid by the purchaser, excluding any VAT or similar tax deductible by the purchaser, in order to take delivery of a unit of a good or service at the time and place required by the purchaser. The purchaser’s price of a good includes any transport charges paid separately by the purchaser to take delivery at the required time and place.
definition: Цена покупателя — это сумма, уплаченная покупателем, исключая любой НДС или аналогичный налог, которые подлежат вычитанию покупателем, за поставку единицы товара или услуги в установленные покупателем сроки и место. Цена покупателя товара включает любые транспортные расходы, оплаченные отдельно покупателем за поставку в установленные сроки и место.
example: Цены: Цена покупателя является конечной ценой потребления и включает в себя НДС, акциз и другие косвенные налоги, а также затраты и прибыль организаций товаропроводящей сети.
in scheme: Глоссарий
preferred label: Purchaser's Price
related: Цена производителя
related: Субсидия на продукт
related: Налог на продукт
related: Цена
related: Товары
top concept of: Глоссарий

Вспомогательная деятельность
type: Concept
comment: Вспомогательной деятельности свойственны некоторые общие черты, производимой ими продукции. Эти дополнительные характеристики следующие: a. Выпуск вспомогательной деятельности не предназначен для использования вне предприятия; b. В результате вспомогательной деятельности, как правило, производится выпуск, обычно используемый в качестве затрат практически в любом виде производственной деятельности; c. Вспомогательная деятельность производит услуги (и, как исключение, товары, которые не становятся физически частью выпуска основной или вторичной деятельности); d. Стоимость выпуска вспомогательной деятельности, как правило, невелика по сравнению со стоимостью выпуска основной или вторичной деятельности предприятия.
source: Система национальных счетов 2008
  source: https://suz.cisstat.org/xwiki/wiki/NationalAccounts/view/%D0%91%D0%B8%D0%B1%D0%BB%D0%B8%D0%BE%D1%82%D0%B5%D0%BA%D0%B0/%D0%A1%D0%B8%D1%81%D1%82%D0%B5%D0%BC%D0%B0%20%D0%BD%D0%B0%D1%86%D0%B8%D0%BE%D0%BD%…
requires: Вторичная деятельность
requires: Предприятие
term status: draft
broader: Производство
definition: An ancillary activity is a supporting activity undertaken within an enterprise in order to create the conditions within which the principal or secondary activities can be carried out.
definition: Вспомогательная деятельность — это деятельность, осуществляемая внутри предприятия, с целью создания условий для осуществления его основной или вторичной деятельности.
in scheme: Глоссарий
preferred label: Ancillary Activity
related: Производство
related: Услуги
related: Вторичная деятельность
related: Предприятие
related: Выпуск
related: Товары
related: Продукты
top concept of: Глоссарий

Некоммерческие организации
type: Concept
comment: На практике их производственная деятельность должна создавать либо доход, либо убыток, но любой доход, который они могут получить, не может быть присвоен другими институциональными единицами. Устав организации, в соответствии с которым они учреждены, сформулирован таким образом, что институциональные единицы, которые их контролируют или управляют ими, не имеют права на получение доли в любых прибылях или других доходах, которые они получают. По этой причине они нередко освобождены от уплаты налогов.
requires: Юридическое лицо
term status: draft
alternative label: НКО
broader: Институциональный сектор
definition: Non-profit institutions (NPIs) are legal or social entities created for the purpose of producing goods and services but whose status does not permit them to be a source of income, profit or other financial gain for the units that establish, control or finance them.
definition: Некоммерческие организации (НКО) — это юридические лица или общественные организации, создаваемые с целью производства товаров и услуг, чей статус не позволяет им быть источником дохода, прибыли или другой финансовой выгоды для единиц, которые их учреждают, контролируют или финансируют.
in scheme: Глоссарий
preferred label: Non-profit institutions
related: Институциональная единица
top concept of: Глоссарий

Услуги
type: Concept
comment: Индивидуальные товары и услуги, как правило, приобретаются и продаются на рынке, хотя они могут также предоставляться бесплатно или в ценах, которые не являются экономически значимыми, например, товары и услуги, предоставляемые в качестве социальных трансфертов в натуральной форме. На практике все товары и большинство услуг являются индивидуальными.
source: Система национальных счетов 2008
  source: https://suz.cisstat.org/xwiki/wiki/NationalAccounts/view/%D0%91%D0%B8%D0%B1%D0%BB%D0%B8%D0%BE%D1%82%D0%B5%D0%BA%D0%B0/%D0%A1%D0%B8%D1%81%D1%82%D0%B5%D0%BC%D0%B0%20%D0%BD%D0%B0%D1%86%D0%B8%D0%BE%D0%BD%…
requires: Производство
requires: Финансовые активы
requires: Продукты
term status: draft
broader: Продукты
definition: Услуги — это результат производственной деятельности, который меняет состояние потребляющих единиц или содействует обмену продуктами или финансовыми активами.
definition: Services are the result of a production activity that changes the conditions of the consuming units, or facilitates the exchange of products or financial assets.
in scheme: Глоссарий
preferred label: Services
related: Товары
related: Цена
top concept of: Глоссарий

Выпуск
type: Concept
comment: Выпуск большей части товаров и услуг обычно регистрируется, когда их производство завершено. Однако, когда требуется длительное время для производства единицы выпуска, тогда необходимо признать, что выпуск производится непрерывно, и необходимо отражать незавершенное производство.
source: Система национальных счетов 2008
  source: https://suz.cisstat.org/xwiki/wiki/NationalAccounts/view/%D0%91%D0%B8%D0%B1%D0%BB%D0%B8%D0%BE%D1%82%D0%B5%D0%BA%D0%B0/%D0%A1%D0%B8%D1%81%D1%82%D0%B5%D0%BC%D0%B0%20%D0%BD%D0%B0%D1%86%D0%B8%D0%BE%D0%BD%…
requires: Производство
requires: Заведение
requires: Запасы
requires: Услуги
requires: Товары
requires: Продукты
term status: draft
broader: Производство
definition: Output is defined as the goods and services produced by an establishment, excluding the value of any goods and services used in an activity for which the establishment does not assume the risk of using the products in production, and excluding the value of goods and services consumed by the same establishment except for goods and services used for capital formation (fixed capital or changes in inventories) or own final consumption.
definition: Выпуск определяется как стоимость товаров и услуг, произведенных заведением, исключая стоимость любых товаров и услуг, использованных в деятельности, в отношении которых заведение не принимает риск, связанный с использованием продуктов в производстве, и исключая стоимость товаров и услуг, потребленных тем же самым заведением, за исключением товаров и услуг, использованных для накопления (основного капитала или запасов материальных оборотных средств) или для собственного конечного потребления.
in scheme: Глоссарий
preferred label: Output
related: Производство
related: Услуги
related: Товары
top concept of: Глоссарий

Налог на продукт
type: Concept
comment: Налог может определяться как установленная сумма, взимаемая с единицы измерения товара или услуги (единица измерения может отражать дискретные единицы или непрерывные физические переменные, например, объем, вес, силу, расстояние, время и т. д.), либо как определенный процент от цены единицы или общей стоимости реализованных товаров и услуг. Налог на продукт, как правило, подлежит уплате на момент производства продукта, его продажи или импорта, однако он может подлежать выплате и при других обстоятельствах, например, когда продукт экспортируется, сдается в аренду, передается в качестве трансферта, поставляется другим единицам или используется для собственного потребления или накопления. В счетах-фактурах, выставляемых предприятиями своим клиентам, сумма налога на продукт может выделяться отдельно, а может и не выделяться.
comment: The tax may be a specific amount of money per unit of quantity of a good or service (the quantity units being measured either in terms of discrete units or continuous physical variables such as volume, weight, strength, distance, time, etc.), or it may be calculated ad valorem as a specified percentage of the price per unit or value of the goods or services transacted. A tax on a product usually becomes payable when it is produced, sold or imported, but it may also become payable in other circumstances, such as when a good is exported, leased, transferred, delivered, or used for own consumption or own capital formation. An enterprise may or may not itemize the amount of a tax on a product separately on the invoice or bill that it charges its customers.
source: Система национальных счетов 2008
  source: https://suz.cisstat.org/xwiki/wiki/NationalAccounts/view/%D0%91%D0%B8%D0%B1%D0%BB%D0%B8%D0%BE%D1%82%D0%B5%D0%BA%D0%B0/%D0%A1%D0%B8%D1%81%D1%82%D0%B5%D0%BC%D0%B0%20%D0%BD%D0%B0%D1%86%D0%B8%D0%BE%D0%BD%…
requires: Услуги
requires: Товары
term status: draft
broader: Налоги на производство, подлежащие выплате
definition: A tax on a product is a tax that is payable per unit of some good or service.
definition: Налог на продукт — это налог, подлежащий уплате за единицу какого-либо товара или услуги.
in scheme: Глоссарий
preferred label: Tax on a Product
related: Производство
related: Weights
related: Потребление
related: Услуги
related: Предприятие
related: Цена
related: Продукты
related: Товары
top concept of: Глоссарий

Единица вида деятельности
type: Concept
comment: Каждое предприятие по определению должно состоять из одной или нескольких единиц вида деятельности. Результаты такого подразделения единицы на две или более единицы вида деятельности являются более однородными с точки зрения выпускаемой ими продукции, структуры их затрат и используемой технологии производства по сравнению с предприятием, рассматриваемым как единое целое.
source: Система национальных счетов 2008
  source: https://suz.cisstat.org/xwiki/wiki/NationalAccounts/view/%D0%91%D0%B8%D0%B1%D0%BB%D0%B8%D0%BE%D1%82%D0%B5%D0%BA%D0%B0/%D0%A1%D0%B8%D1%81%D1%82%D0%B5%D0%BC%D0%B0%20%D0%BD%D0%B0%D1%86%D0%B8%D0%BE%D0%BD%…
requires: Производство
requires: Предприятие
requires: Валовая добавленная стоимость
term status: draft
broader: Предприятие
definition: Единица вида деятельности — это предприятие или часть предприятия, которые заняты только одним видом производственной деятельности или в которых большая часть валовой добавленной стоимости получается от основной производственной деятельности.
definition: A kind-of-activity unit is an enterprise, or a part of an enterprise, that engages in only one kind of productive activity or in which the principal productive activity accounts for most of the value added.
in scheme: Глоссарий
preferred label: Kind-of-Activity Unit
related: Производство
related: Предприятие
related: Продукты
top concept of: Глоссарий

Потребительские товары и услуги
type: Concept
comment: В случае товаров различие между приобретением и потреблением является очевидным. Производители приобретают товары, которые они могут хранить на протяжении различных периодов времени, прежде чем физически израсходовать их в процессе производства. Домашние хозяйства могут хранить потребительские товары до того, как использовать их для удовлетворения своих потребностей или желаний. Только небольшое число товаров являются на столько скоропортящимися, что они должны использоваться немедленно. Например, большинство продовольственных товаров не требуется потреблять немедленно после того, как они были приобретены. В случае услуг, однако, различие между приобретением и использованием может не иметь практического смысла. Положение единиц, которым предоставлены услуги, может автоматически зависеть от предоставленных услуг, и какие-либо дальнейшие действия могут не потребоваться, чтобы от услуг была получена выгода.
source: Система национальных счетов 2008
  source: https://suz.cisstat.org/xwiki/wiki/NationalAccounts/view/%D0%91%D0%B8%D0%B1%D0%BB%D0%B8%D0%BE%D1%82%D0%B5%D0%BA%D0%B0/%D0%A1%D0%B8%D1%81%D1%82%D0%B5%D0%BC%D0%B0%20%D0%BD%D0%B0%D1%86%D0%B8%D0%BE%D0%BD%…
requires: Некоммерческие организации, обслуживающие домашние хозяйства
requires: Производство
requires: Домашнее хозяйство
requires: Услуги
requires: Органы государственного управления
requires: Товары
term status: draft
definition: Потребительский товар или услуга определяются как товар или услуга, которые используются (без дальнейшей переработки в производстве, как оно определено в СНС) домашними хозяйствами, <a target="_blank" rel="noopener noreferrer" href="https://suz.cisstat.org/xwiki/wiki/NationalAccounts/view/%D0%93%D0%BB%D0%BE%D1%81%D1%81%D0%B0%D1%80%D0%B8%D0%B8/%D0%9D%D0%B5%D0%BA%D0%BE%D0%BC%D0%BC%D0%B5%D1%80%D1%87%D0%B5%D1%81%D0%BA%D0%B8%D0%B5%20%D0%BE%D1%80%D0%B3%D0%B0%D0%BD%D0%B8%D0%B7%D0%B0%D1%86%D0%B8%D0%B8%2C%20%D0%BE%D0%B1%D1%81%D0%BB%D1%83%D0%B6%D0%B8%D0%B2%D0%B0%D1%8E%D1%89%D0%B8%D0%B5%20%D0%B4%D0%BE%D0%BC%D0%B0%D1%88%D0%BD%D0%B8%D0%B5%20%D1%85%D0%BE%D0%B7%D1%8F%D0%B9%D1%81%D1%82%D0%B2%D0%B0/">НКОДХ или органами государственного управления для прямого удовлетворения индивидуальных потребностей (или желаний) либо коллективных потребностей членов общества в целом
definition: A consumption good or service is defined as a good or service that is used (without further transformation in production as defined in the SNA) by households, NPISHs or government units for the direct satisfaction of individual needs (or wants) or for the collective needs of members of the community
example: Уровень и условия жизни: В разделе «Уровень и условия жизни» применяется только к домохозяйствам и отражает личный характер потребления.
in scheme: Глоссарий
preferred label: Consumption Good Or Service
related: Производство
related: Потребление
related: Домашнее хозяйство
related: Услуги
related: Товары
top concept of: Глоссарий

Валовое накопление основного капитала
type: Concept
comment: In order to ensure that the coverage of gross fixed capital formation is precisely defined, it is necessary first to define what does and what does not constitute a fixed asset and what activities are treated as adding to the value of non-produced assets.
comment: С целью точного определения охвата валового накопления основного капитала необходимо сначала установить, что относится и что не относится к основным фондам, и какая деятельность, увеличивающая стоимость непроизведенных активов, отражается в счетах как элемент валового накопления основного капитала.
source: Система национальных счетов 2008
  source: https://suz.cisstat.org/xwiki/wiki/NationalAccounts/view/%D0%91%D0%B8%D0%B1%D0%BB%D0%B8%D0%BE%D1%82%D0%B5%D0%BA%D0%B0/%D0%A1%D0%B8%D1%81%D1%82%D0%B5%D0%BC%D0%B0%20%D0%BD%D0%B0%D1%86%D0%B8%D0%BE%D0%BD%…
term status: draft
preferred label: Gross Fixed Capital Formation
definition: Gross fixed capital formation is measured by the total value of a producer’s acquisitions, less disposals, of fixed assets during the accounting period plus certain specified expenditure on services that adds to the value of non-produced assets.
definition: Валовое накопление основного капитала определяется как общая стоимость приобретения производителем основных фондов (за вычетом их выбытия) в течение отчетного периода плюс некоторые расходы на услуги, которые увеличивают стоимость непроизведенных активов.
in scheme: Глоссарий
top concept of: Глоссарий

Основная деятельность
type: Concept
comment: Основная деятельность предприятия включает основной продукт и любые побочные продукты (продукты, неизбежно получаемые вместе с основным продуктом). Выпуск, создаваемый в процессе основной деятельности, должен состоять из товаров и услуг, которые могут быть поставлены другим единицам, включая те, которые используются для собственного потребления или собственного накопления.
source: Система национальных счетов 2008
  source: https://suz.cisstat.org/xwiki/wiki/NationalAccounts/view/%D0%91%D0%B8%D0%B1%D0%BB%D0%B8%D0%BE%D1%82%D0%B5%D0%BA%D0%B0/%D0%A1%D0%B8%D1%81%D1%82%D0%B5%D0%BC%D0%B0%20%D0%BD%D0%B0%D1%86%D0%B8%D0%BE%D0%BD%…
term status: draft
broader: Производство
definition: Основная деятельность характеризуется тем, что созданная в ее процессе добавленная стоимость больше добавленной стоимости любой другой деятельности, выполняемой той же самой единицей.
definition: The principal activity of a producer unit is the activity whose value added exceeds that of any other activity carried out within the same unit.
in scheme: Глоссарий
preferred label: Principal Activity
related: Потребление
related: Услуги
related: Предприятие
related: Выпуск
related: Товары
related: Продукты
top concept of: Глоссарий

ВВП, исчисленный методом конечного использования
type: Concept
source: Система национальных счетов 2008
  source: https://suz.cisstat.org/xwiki/wiki/NationalAccounts/view/%D0%91%D0%B8%D0%B1%D0%BB%D0%B8%D0%BE%D1%82%D0%B5%D0%BA%D0%B0/%D0%A1%D0%B8%D1%81%D1%82%D0%B5%D0%BC%D0%B0%20%D0%BD%D0%B0%D1%86%D0%B8%D0%BE%D0%BD%…
term status: draft
alternative label: GDP Expenditure Measure
broader: Валовый внутренний продукт
definition: The expenditure measure of gross domestic product (GDP) is derived as the sum of expenditure on final consumption plus gross capital formation plus exports less imports.
definition: Оценка валового внутреннего продукта (ВВП) методом конечного использования получается как сумма расходов на конечное потребление, плюс валовое накопление, плюс экспорт, минус импорт.
in scheme: Глоссарий
preferred label: Expenditure Measure of GDP
top concept of: Глоссарий

Другие потоки
type: Concept
source: Система национальных счетов 2008
  source: https://suz.cisstat.org/xwiki/wiki/NationalAccounts/view/%D0%91%D0%B8%D0%B1%D0%BB%D0%B8%D0%BE%D1%82%D0%B5%D0%BA%D0%B0/%D0%A1%D0%B8%D1%81%D1%82%D0%B5%D0%BC%D0%B0%20%D0%BD%D0%B0%D1%86%D0%B8%D0%BE%D0%BD%…
requires: Обязательство
requires: Операция
requires: Актив
term status: draft
broader: Экономические потоки
definition: Другие потоки представляют собой изменения в стоимости активов и обязательств, которые не являются результатами операций.
definition: Other flows are changes in the value of assets and liabilities that do not result from transactions.
in scheme: Глоссарий
preferred label: Other flows
top concept of: Глоссарий

Некоммерческие организации, обслуживающие домашние хозяйства
type: Concept
comment: Они предоставляют товары и услуги домашним хозяйствам бесплатно или по экономически незначимым ценам. Большая часть этих товаров и услуг представляют собой индивидуальное потребление, но НКОДХ могут предоставлять и коллективные услуги.
requires: Некоммерческие организации
requires: Органы государственного управления
term status: draft
alternative label: НКОДХ
broader: Институциональный сектор
definition: Non-profit institutions serving households (NPISHs) consist of non-market NPIs that are not controlled by government.
definition: Некоммерческие организации, обслуживающие домашние хозяйства (НКОДХ), состоят из нерыночных НКО, которые не контролируются органами государственного управления.
in scheme: Глоссарий
preferred label: Non-profit institutions serving households
related: Домашнее хозяйство
top concept of: Глоссарий

Капитальные трансферты
type: Concept
comment: Капитальные трансферты являются обычно значительными по величине и нерегулярными, но ни то, ни другое не является необходимым условием для того, чтобы трансферт рассматривался как капитальный, а не текущий. Если возникает сомнение относительно того, следует ли отражать трансферт как текущий или как капитальный, его следует отражать как текущий.
comment: Capital transfers are often large and irregular but neither of these are necessary conditions for a transfer to be considered a capital rather than a current transfer. If there is doubt about whether a transfer should be treated as current or capital, it should be treated as current.
source: Система национальных счетов 2008
  source: https://suz.cisstat.org/xwiki/wiki/NationalAccounts/view/%D0%91%D0%B8%D0%B1%D0%BB%D0%B8%D0%BE%D1%82%D0%B5%D0%BA%D0%B0/%D0%A1%D0%B8%D1%81%D1%82%D0%B5%D0%BC%D0%B0%20%D0%BD%D0%B0%D1%86%D0%B8%D0%BE%D0%BD%…
requires: Актив
term status: draft
definition: Капитальные трансферты представляют собой безвозмездные трансферты, при которых либо сторона, осуществляющая трансферт, использует соответствующие ресурсы путем передачи актива (кроме наличных денежных средств и материальных оборотных средств) или погашения финансового требования (кроме дебиторской задолженности), либо сторона, получающая трансферт, обязана приобрести некоторый актив (кроме наличных денежных средств), либо имеют место оба условия.
definition: Capital transfers are unrequited transfers where either the party making the transfer realizes the funds involved by disposing of an asset (other than cash or inventories), relinquishing a financial claim (other than accounts receivable) or the party receiving the transfer is obliged to acquire an asset (other than cash) or both conditions are met.
in scheme: Глоссарий
preferred label: Capital Transfers
top concept of: Глоссарий

Промежуточное потребление
type: Concept
comment: Товары и услуги могут быть либо трансформированы, либо полностью использованы в процессе производства. Некоторые израсходованные продукты появляются вновь после их трансформации и включения в стоимость произведенного продукта, например, зерно может быть переработано в муку, которая, в свою очередь, используется для производства хлеба. Другие продукты полностью потребляются в процессе производства, например, электроэнергия и большая часть услуг.
source: Система национальных счетов 2008
  source: https://suz.cisstat.org/xwiki/wiki/NationalAccounts/view/%D0%91%D0%B8%D0%B1%D0%BB%D0%B8%D0%BE%D1%82%D0%B5%D0%BA%D0%B0/%D0%A1%D0%B8%D1%81%D1%82%D0%B5%D0%BC%D0%B0%20%D0%BD%D0%B0%D1%86%D0%B8%D0%BE%D0%BD%…
requires: Потребление основного капитала
requires: Производство
requires: Потребление
requires: Услуги
requires: Товары
term status: draft
broader: Потребление
definition: Промежуточное потребление включает стоимость товаров и услуг, потребленных в качестве затрат в процессе производства, за исключением основных фондов, потребление которых отражается как потребление основного капитала.
definition: Intermediate consumption consists of the value of the goods and services consumed as inputs by a process of production, excluding fixed assets whose consumption is recorded as consumption of fixed capital.
in scheme: Глоссарий
preferred label: Intermediate Consumption
related: Производство
related: Услуги
related: Товары
related: Продукты
top concept of: Глоссарий

Органы государственного управления
type: Concept
comment: Основные функции органов государственного управления как институциональных единиц состоят в том, чтобы принимать ответственность за предоставление товаров и услуг обществу в целом или отдельным домашним хозяйствам и финансировать предоставление этих товаров и услуг за счет налоговых поступлений или других доходов; перераспределять доход и богатство с помощью трансфертов; и осуществлять нерыночное производство.
requires: Институциональная единица
requires: Юридическое лицо
term status: draft
alternative label: Государственная единица
broader: Институциональная единица
definition: Органы государственного управления (государственные единицы) представляют собой уникальные типы юридических лиц, учрежденные в результате политических процессов, которые обладают законодательной, судебной или исполнительной властью в отношении других институциональных единиц в пределах данной территории.
definition: Government units are unique kinds of legal entities established by political processes that have legislative, judicial or executive authority over other institutional units within a given area.
in scheme: Глоссарий
preferred label: Government units
related: Институциональная единица
related: Домашнее хозяйство
top concept of: Глоссарий

Чистое кредитование
type: Concept
source: Система национальных счетов 2008
  source: https://suz.cisstat.org/xwiki/wiki/NationalAccounts/view/%D0%91%D0%B8%D0%B1%D0%BB%D0%B8%D0%BE%D1%82%D0%B5%D0%BA%D0%B0/%D0%A1%D0%B8%D1%81%D1%82%D0%B5%D0%BC%D0%B0%20%D0%BD%D0%B0%D1%86%D0%B8%D0%BE%D0%BD%…
term status: draft
definition: Net lending is defined as the difference between changes in net worth due to saving and capital transfers and net acquisitions of non-financial assets (acquisitions less disposals of non-financial assets, less consumption of fixed capital). If the amount is negative it represents net borrowing.
definition: Чистое кредитование определяется как разница между изменением чистой стоимости капитала вследствие сбережения и капитальных трансфертов и чистым приобретением нефинансовых активов (приобретение нефинансовых активов за вычетом выбытия, минус потребление основного капитала). Если эта величина отрицательна, она представляет собой чистое заимствование.
in scheme: Глоссарий
preferred label: Net Lending
top concept of: Глоссарий

Товар длительного пользования
type: Concept
comment: Потребительский товар длительного пользования — это товар, который может использоваться для целей потребления неоднократно или непрерывно на протяжении одного года или больше. В случае с товарами различие между приобретением и использованием является важным с аналитической точки зрения. Оно особенно важно в случае с различием между товарами длительного пользования и товарами не длительного пользования, которое широко используется в экономическом анализе. В действительности различие между товарами длительного пользования и товарами недлительного пользования не основано на времени физической сохранности как таковой. Вместо этого различие основано на том, могут ли товары использоваться в целях производства или потребления только однажды или они могут использоваться неоднократно или непрерывно. Например, уголь является товаром длительного пользования в физическом смысле, но он может быть сожжен только однажды.
source: Система национальных счетов 2008
  source: https://suz.cisstat.org/xwiki/wiki/NationalAccounts/view/%D0%91%D0%B8%D0%B1%D0%BB%D0%B8%D0%BE%D1%82%D0%B5%D0%BA%D0%B0/%D0%A1%D0%B8%D1%81%D1%82%D0%B5%D0%BC%D0%B0%20%D0%BD%D0%B0%D1%86%D0%B8%D0%BE%D0%BD%…
requires: Товары
term status: draft
broader: Товары
definition: Товар длительного пользования — это товар, который может использоваться неоднократно или непрерывно на протяжении одного года или больше с учетом нормальной или средней нормы физического использования.
definition: A durable good is one that may be used repeatedly or continuously over a period of more than a year, assuming a normal or average rate of physical usage. A consumer durable is a good that may be used for purposes of consumption repeatedly or continuously over a period of a year or more.
in scheme: Глоссарий
preferred label: Durable Good
related: Производство
related: Потребление
related: Товары
top concept of: Глоссарий

Потребление основного капитала
type: Concept
comment: Термин «амортизация» часто используется вместо термина «потребление основного капитала», но он намеренно не используется в СНС, так как в бухгалтерском учете термин «амортизация» часто используется для обозначения снижения первоначальной стоимости основных фондов, тогда как в СНС потребление основного капитала определяется на основе оценки основных фондов в текущих ценах. Потребление основного капитала исчисляется в отношении всех основных фондов, находящихся в собственности производителя, но не в отношении ценностей (драгоценных металлов, камней и т. д.), которые приобретаются как раз в связи с тем, что их стоимость не снижается со временем. Основные фонды должны быть произведены в качестве выпуска процесса производства, как оно определено в СНС. Потребление основного капитала не включает истощение или деградацию природных активов, таких как земля, минералы или другие полезные ископаемые, уголь, нефть, природный газ; оно также не включает контракты, договоры аренды и лицензии.
source: Система национальных счетов 2008
  source: https://suz.cisstat.org/xwiki/wiki/NationalAccounts/view/%D0%91%D0%B8%D0%B1%D0%BB%D0%B8%D0%BE%D1%82%D0%B5%D0%BA%D0%B0/%D0%A1%D0%B8%D1%81%D1%82%D0%B5%D0%BC%D0%B0%20%D0%BD%D0%B0%D1%86%D0%B8%D0%BE%D0%BD%…
requires: Запасы
requires: CurrentPeriod
term status: draft
definition: Consumption of fixed capital is the decline, during the course of the accounting period, in the current value of the stock of fixed assets owned and used by a producer as a result of physical deterioration, normal obsolescence or normal accidental damage.
definition: Потребление основного капитала — это уменьшение в течение отчетного периода текущей стоимости запаса основных фондов, принадлежащих производителю и используемых им, в результате физического износа, нормального морального износа или случайных повреждений.
in scheme: Глоссарий
preferred label: Consumption Of Fixed Capital
related: Ценности
related: Производство
related: Актив
related: Выпуск
related: Цена
top concept of: Глоссарий

Заведение
type: Concept
comment: Хотя в определении заведения предусмотрена возможность осуществления одного или нескольких видов вторичной деятельности, ее масштабы должны быть невелики по сравнению с основной. Когда вторичная деятельность внутри предприятия приобретает столь же значительные (или приближенные к ним) размеры, как основная, считается, что она осуществляется в рамках заведения, отдельного от заведения, занятого основной деятельностью. Таким образом, заведения образуют единицы, данные о которых более пригодны для анализа производства, где технология производства играет важную роль.
source: Система национальных счетов 2008
  source: https://suz.cisstat.org/xwiki/wiki/NationalAccounts/view/%D0%91%D0%B8%D0%B1%D0%BB%D0%B8%D0%BE%D1%82%D0%B5%D0%BA%D0%B0/%D0%A1%D0%B8%D1%81%D1%82%D0%B5%D0%BC%D0%B0%20%D0%BD%D0%B0%D1%86%D0%B8%D0%BE%D0%BD%…
requires: EconomicActivity
requires: Предприятие
requires: Основная деятельность
term status: draft
broader: Предприятие
definition: An establishment is an enterprise, or part of an enterprise, that is situated in a single location and in which only a single productive activity is carried out or in which the principal productive activity accounts for most of the value added.
definition: Заведение — это предприятие или часть предприятия, которое находится в каком-то одном месте и на котором осуществляется только один вид экономической деятельности или в котором на основной вид деятельности приходится бόльшая (преобладающая) часть добавленной стоимости.
in scheme: Глоссарий
preferred label: Establishment
related: Производство
related: Вторичная деятельность
related: Предприятие
related: Основная деятельность
top concept of: Глоссарий

Текущий трансферт
type: Concept
comment: Текущие трансферты могут иметь место как между резидентами и нерезидентами, так и между институциональными единицами-резидентами. В счете вторичного распределения доходов различают следующие три основных вида текущих трансфертов: текущие налоги на доходы, налоги на имущество и т. д.; отчисления на социальное страхование и социальные пособия; другие текущие трансферты.
source: Система национальных счетов 2008
  source: https://suz.cisstat.org/xwiki/wiki/NationalAccounts/view/%D0%91%D0%B8%D0%B1%D0%BB%D0%B8%D0%BE%D1%82%D0%B5%D0%BA%D0%B0/%D0%A1%D0%B8%D1%81%D1%82%D0%B5%D0%BC%D0%B0%20%D0%BD%D0%B0%D1%86%D0%B8%D0%BE%D0%BD%…
requires: Институциональная единица
requires: Операция
requires: Актив
requires: Товары
term status: draft
definition: A current transfer is a transaction in which one institutional unit provides a good, service or asset to another unit without receiving from the latter any good, service or asset directly in return as counterpart and does not oblige one or both parties to acquire, or dispose of, an asset.
definition: Текущий трансферт представляет собой экономическую операцию, в результате которой одна институциональная единица предоставляет другой единице товар, услугу или актив, не получая от нее взамен какого-либо товара, услуги или актива в качестве эквивалента, и которая не предполагает обязательств одной стороны или обеих сторон приобрести или реализовать актив.
in scheme: Глоссарий
preferred label: Current Transfer
top concept of: Глоссарий

Расходы на конечное потребление домашних хозяйств
type: Concept
source: Система национальных счетов 2008
  source: https://suz.cisstat.org/xwiki/wiki/NationalAccounts/view/%D0%91%D0%B8%D0%B1%D0%BB%D0%B8%D0%BE%D1%82%D0%B5%D0%BA%D0%B0/%D0%A1%D0%B8%D1%81%D1%82%D0%B5%D0%BC%D0%B0%20%D0%BD%D0%B0%D1%86%D0%B8%D0%BE%D0%BD%…
requires: Резидентство
requires: Домашнее хозяйство
requires: Услуги
requires: Товары
term status: draft
broader: Расходы на конечное потребление
definition: Расходы на конечное потребление домашних хозяйств состоят из расходов (включая расходы, стоимость которых должна быть оценена косвенным образом), понесенных домашними хозяйствами — резидентами данной страны — на товары и услуги индивидуального потребления, включая купленные по ценам, которые не являются экономически значимыми, и включая потребительские товары и услуги, приобретенные за границей.
definition: Household final consumption expenditure consists of the expenditure, including expenditure whose value must be estimated indirectly, incurred by resident households on individual consumption goods and services, including those sold at prices that are not economically significant and including consumption goods and services acquired abroad.
in scheme: Глоссарий
preferred label: Household Final Consumption Expenditure
top concept of: Глоссарий