Налог на добавленную стоимость
type: Concept
comment: Такие налоги описываются как «вычитаемые» налоги, поскольку производители, как правило, не обязаны вносить в бюджет полную сумму, начисленную ими к оплате своим заказчикам. Им разрешено вычитать сумму налога, которая уплачена ими за товары и услуги, приобретенные для промежуточного потребления или накопления основного капитала. Обычно НДС рассчитывается на основе цены товара или услуги, которая включает суммы любых других налогов на продукты. НДС взимается также с импортируемых товаров и услуг, наряду с другими импортными пошлинами и налогами на импорт (РСГФ-2001, 11411; ОЭСР, 5111).
comment: They are described as a “deductible” tax because producers are not usually required to pay to the government the full amount of the tax they invoice to their customers, being permitted to deduct the amount of tax they have been invoiced on their own purchases of goods or services intended for intermediate consumption or fixed capital formation. VAT is usually calculated on the price of the good or service including any other tax on the product. VAT is also payable on imports of goods or services in addition to any import duties or other taxes on the imports (GFSM2001 11411; OECD, 5111).
source: Система национальных счетов 2008
  source: https://stat.semanticpro.org/xwiki/wiki/NationalAccounts/view/%D0%91%D0%B8%D0%B1%D0%BB%D0%B8%D0%BE%D1%82%D0%B5%D0%BA%D0%B0/%D0%A1%D0%B8%D1%81%D1%82%D0%B5%D0%BC%D0%B0%20%D0%BD%D0%B0%D1%86%D0%B8%D0%BE%D…
requires: Предприятие
requires: Налоги
requires: Товары
requires: Услуги
term status: draft
alternative label: НДС
alternative label: VAT
broader: Налоги
definition: Налог на добавленную стоимость (НДС) — это налог на товары или услуги, поэтапно взимаемый предприятиями, но в конечном итоге уплачиваемый в полном объеме конечными покупателями.
definition: A value added type tax (VAT) is a tax on goods or services collected in stages by enterprises but that is ultimately charged in full to the final purchasers.
in scheme: Глоссарий
preferred label: Value Added Tax
related: Цена
related: Импортные пошлины
related: Товары
related: Налоги
related: Промежуточное потребление
related: Налог на продукт
related: Услуги
top concept of: Глоссарий

Субсидии на экспорт
type: Concept
comment: В эту группу включаются следующие субсидии: a. Прямые субсидии на экспорт: предоставляются непосредственно производителям-резидентам при вывозе товаров с экономической территории страны или при оказании услуг нерезидентам. b. Возмещение убытков государственных внешнеторговых организаций: это убытки, понесенные государственными внешнеторговыми организациями, специализирующимися на закупках продукции предприятий-резидентов и ее последующей продаже по более низким ценам нерезидентам, если такие потери являются результатом целенаправленной политики органов государственного управления. Разница межу закупочной и продажной ценой составляет экспортную субсидию. c. Субсидии, возникающие в результате функционирования множественных валютных курсов: включают субсидии на экспорт, выплачиваемые в неявной форме, возникающие в результате функционирования официальной системы множественных курсов валют.
source: Система национальных счетов 2008
  source: https://stat.semanticpro.org/xwiki/wiki/NationalAccounts/view/%D0%91%D0%B8%D0%B1%D0%BB%D0%B8%D0%BE%D1%82%D0%B5%D0%BA%D0%B0/%D0%A1%D0%B8%D1%81%D1%82%D0%B5%D0%BC%D0%B0%20%D0%BD%D0%B0%D1%86%D0%B8%D0%BE%D…
requires: Товары
requires: Субсидии
requires: Органы государственного управления
requires: Услуги
term status: draft
broader: Субсидии
definition: Субсидии на экспорт включают все субсидии на товары и услуги, которые подлежат выплате органами государственного управления, когда товары покидают экономическую территорию страны или когда услуги предоставлены нерезидентам.
definition: Export subsidies consist of all subsidies on goods and services that become payable by government when the goods leave the economic territory or when the services are delivered to non-resident units.
in scheme: Глоссарий
preferred label: Export Subsidies
related: Предприятие
related: Цена
related: Продукты
related: Товары
related: Субсидии
related: Органы государственного управления
related: Услуги
top concept of: Глоссарий

Незаработанная страховая премия
type: Concept
source: Система национальных счетов 2008
  source: https://stat.semanticpro.org/xwiki/wiki/NationalAccounts/view/%D0%91%D0%B8%D0%B1%D0%BB%D0%B8%D0%BE%D1%82%D0%B5%D0%BA%D0%B0/%D0%A1%D0%B8%D1%81%D1%82%D0%B5%D0%BC%D0%B0%20%D0%BD%D0%B0%D1%86%D0%B8%D0%BE%D…
requires: Фактическая страховая премия
term status: draft
broader: Фактическая страховая премия
definition: The unearned premium is the amount of the actual premium received that relates to the period past the accounting point.
definition: Незаработанная страховая премия — это часть фактической полученной страховой премии, которая относится к периоду после отчетного периода.
in scheme: Глоссарий
preferred label: Unearned remium
top concept of: Глоссарий

Текущие трансферты в рамках международного сотрудничества
type: Concept
comment: Они включают: а. Трансферты между органами государственного управления, используемые их получателями для финансирования текущих расходов, включая экстренную помощь после стихийных бедствий; они включают трансферты в натуральной форме в виде продовольствия, одежды, одеял, лекарств и т.п.; b. Ежегодные и другие регулярные взносы, уплачиваемые правительствами государств-членов в международные организации (за исключением налогов, уплачиваемых наднациональным организациям); с. Выплаты органами государственного управления одних стран или международными организациями органам государственного управления других стран для обеспечения выплаты заработной платы работникам, занимающимся оказанием технической помощи и являющимся резидентами страны, в которой они работают, и наемным работникам органов государственного управления принимающей стороны.
source: Система национальных счетов 2008
  source: https://stat.semanticpro.org/xwiki/wiki/NationalAccounts/view/%D0%91%D0%B8%D0%B1%D0%BB%D0%B8%D0%BE%D1%82%D0%B5%D0%BA%D0%B0/%D0%A1%D0%B8%D1%81%D1%82%D0%B5%D0%BC%D0%B0%20%D0%BD%D0%B0%D1%86%D0%B8%D0%BE%D…
requires: Текущий трансферт
requires: Органы государственного управления
term status: draft
broader: Текущий трансферт
definition: Current international cooperation consists of current transfers in cash or in kind between the governments of different countries or between governments and international organizations.
definition: Текущие трансферты в рамках международного сотрудничества включают текущие трансферты в денежной или натуральной форме между органами государственного управления различных стран или между органами государственного управления стран и международными организациями.
in scheme: Глоссарий
preferred label: Current International Cooperation
related: Трансферт
related: Налоги
related: Органы государственного управления
top concept of: Глоссарий

Социальные трансферты в натуральной форме
type: Concept
comment: Социальные трансферты в натуральной форме состоят из потребительских товаров и услуг, расходы на которые осуществляются органами государственного управления и единицами сектора <a target="_blank" rel="noopener noreferrer" href="https://stat.semanticpro.org/xwiki/wiki/NationalAccounts/view/%D0%93%D0%BB%D0%BE%D1%81%D1%81%D0%B0%D1%80%D0%B8%D0%B8/%D0%9D%D0%B5%D0%BA%D0%BE%D0%BC%D0%BC%D0%B5%D1%80%D1%87%D0%B5%D1%81%D0%BA%D0%B8%D0%B5%20%D0%BE%D1%80%D0%B3%D0%B0%D0%BD%D0%B8%D0%B7%D0%B0%D1%86%D0%B8%D0%B8%2C%20%D0%BE%D0%B1%D1%81%D0%BB%D1%83%D0%B6%D0%B8%D0%B2%D0%B0%D1%8E%D1%89%D0%B8%D0%B5%20%D0%B4%D0%BE%D0%BC%D0%B0%D1%88%D0%BD%D0%B8%D0%B5%20%D1%85%D0%BE%D0%B7%D1%8F%D0%B9%D1%81%D1%82%D0%B2%D0%B0/">НКОДХ от имени домашних хозяйств. По этой причине они называются индивидуальными товарами и услугами.
source: Система национальных счетов 2008
  source: https://stat.semanticpro.org/xwiki/wiki/NationalAccounts/view/%D0%91%D0%B8%D0%B1%D0%BB%D0%B8%D0%BE%D1%82%D0%B5%D0%BA%D0%B0/%D0%A1%D0%B8%D1%81%D1%82%D0%B5%D0%BC%D0%B0%20%D0%BD%D0%B0%D1%86%D0%B8%D0%BE%D…
requires: Некоммерческие организации, обслуживающие домашние хозяйства
requires: Цена
requires: Товары
requires: Домашнее хозяйство
requires: Органы государственного управления
requires: Услуги
term status: draft
definition: Социальные трансферты в натуральной форме включают товары и услуги, предоставляемые домашним хозяйствам органами государственного управления и единицами сектора <a target="_blank" rel="noopener noreferrer" href="https://stat.semanticpro.org/xwiki/wiki/NationalAccounts/view/%D0%93%D0%BB%D0%BE%D1%81%D1%81%D0%B0%D1%80%D0%B8%D0%B8/%D0%9D%D0%B5%D0%BA%D0%BE%D0%BC%D0%BC%D0%B5%D1%80%D1%87%D0%B5%D1%81%D0%BA%D0%B8%D0%B5%20%D0%BE%D1%80%D0%B3%D0%B0%D0%BD%D0%B8%D0%B7%D0%B0%D1%86%D0%B8%D0%B8%2C%20%D0%BE%D0%B1%D1%81%D0%BB%D1%83%D0%B6%D0%B8%D0%B2%D0%B0%D1%8E%D1%89%D0%B8%D0%B5%20%D0%B4%D0%BE%D0%BC%D0%B0%D1%88%D0%BD%D0%B8%D0%B5%20%D1%85%D0%BE%D0%B7%D1%8F%D0%B9%D1%81%D1%82%D0%B2%D0%B0/">НКОДХ бесплатно или по экономически незначимым ценам.
definition: Social transfers in kind consist of goods and services provided to households by government and NPISHs either free or at prices that are not economically significant.
in scheme: Глоссарий
preferred label: Social Transfers in Kind
related: Некоммерческие организации, обслуживающие домашние хозяйства
related: Товары
related: Трансферт
related: Домашнее хозяйство
related: Органы государственного управления
related: Услуги
related: Потребительские товары и услуги
top concept of: Глоссарий

Промежуточное потребление
type: Concept
comment: Товары и услуги могут быть либо трансформированы, либо полностью использованы в процессе производства. Некоторые израсходованные продукты появляются вновь после их трансформации и включения в стоимость произведенного продукта, например, зерно может быть переработано в муку, которая, в свою очередь, используется для производства хлеба. Другие продукты полностью потребляются в процессе производства, например, электроэнергия и большая часть услуг.
source: Система национальных счетов 2008
  source: https://stat.semanticpro.org/xwiki/wiki/NationalAccounts/view/%D0%91%D0%B8%D0%B1%D0%BB%D0%B8%D0%BE%D1%82%D0%B5%D0%BA%D0%B0/%D0%A1%D0%B8%D1%81%D1%82%D0%B5%D0%BC%D0%B0%20%D0%BD%D0%B0%D1%86%D0%B8%D0%BE%D…
requires: Товары
requires: Потребление основного капитала
requires: Потребление
requires: Услуги
requires: Производство
term status: draft
broader: Потребление
definition: Intermediate consumption consists of the value of the goods and services consumed as inputs by a process of production, excluding fixed assets whose consumption is recorded as consumption of fixed capital.
definition: Промежуточное потребление включает стоимость товаров и услуг, потребленных в качестве затрат в процессе производства, за исключением основных фондов, потребление которых отражается как потребление основного капитала.
in scheme: Глоссарий
preferred label: Intermediate Consumption
related: Продукты
related: Товары
related: Производство
related: Услуги
top concept of: Глоссарий

Чистые отчисления на социальное страхование
type: Concept
source: Система национальных счетов 2008
  source: https://stat.semanticpro.org/xwiki/wiki/NationalAccounts/view/%D0%91%D0%B8%D0%B1%D0%BB%D0%B8%D0%BE%D1%82%D0%B5%D0%BA%D0%B0/%D0%A1%D0%B8%D1%81%D1%82%D0%B5%D0%BC%D0%B0%20%D0%BD%D0%B0%D1%86%D0%B8%D0%BE%D…
requires: Программа социального страхования
requires: Домашнее хозяйство
requires: Социальные пособия
requires: Услуги
term status: draft
definition: Net social contributions are the actual or imputed contributions made by households to social insurance schemes to make provision for social benefits to be paid. Fees charged by the administrators of the schemes are excluded from contributions payable.
definition: Чистые отчисления на социальное страхование — это фактические или условно исчисленные отчисления, производимые домашними хозяйствами в программы социального страхования, чтобы обеспечить средства для выплаты социальных пособий. Оплата услуг, взимаемая администраторами программ, исключается из отчислений, подлежащих выплате.
in scheme: Глоссарий
preferred label: Net Social Contributions
top concept of: Глоссарий

Нереализованная холдинговая прибыль
type: Concept
source: Система национальных счетов 2008
  source: https://stat.semanticpro.org/xwiki/wiki/NationalAccounts/view/%D0%91%D0%B8%D0%B1%D0%BB%D0%B8%D0%BE%D1%82%D0%B5%D0%BA%D0%B0/%D0%A1%D0%B8%D1%81%D1%82%D0%B5%D0%BC%D0%B0%20%D0%BD%D0%B0%D1%86%D0%B8%D0%BE%D…
requires: Институциональная единица
requires: Обязательство
requires: Актив
term status: draft
definition: Нереализованная холдинговая прибыль — это прибыль, которая поступила на актив, который все еще остается в собственности институциональной единицы, или на обязательство, которое все еще не оплачено на конец отчетного периода.
definition: An unrealized holding gain is one accruing on an asset that is still owned or a liability that is still outstanding at the end of the accounting period.
in scheme: Глоссарий
preferred label: Unrealized Holding Gain
top concept of: Глоссарий

Счет товаров и услуг
type: Concept
comment: В интегрированных экономических счетах счет товаров и услуг показывается в колонке, а не по строке. Он отражает различные операции с товарами и услугами, которые регистрируются в счетах институциональных секторов. Промежуточное потребление и конечное потребление показываются как использование в счетах институциональных секторов на левой стороне. В счете товаров и услуг они появляются в колонке на правой стороне, хотя правая сторона обычно предназначается для ресурсов, а потребление является использованием. Это отклонение от обычного использования противоположной стороны счета позволяет сбалансировать строки для каждой статьи в счете товаров и услуг.
source: Система национальных счетов 2008
  source: https://stat.semanticpro.org/xwiki/wiki/NationalAccounts/view/%D0%91%D0%B8%D0%B1%D0%BB%D0%B8%D0%BE%D1%82%D0%B5%D0%BA%D0%B0/%D0%A1%D0%B8%D1%81%D1%82%D0%B5%D0%BC%D0%B0%20%D0%BD%D0%B0%D1%86%D0%B8%D0%BE%D…
requires: Товары
requires: Промежуточное потребление
requires: Субсидия на продукт
requires: Потребление
requires: Выпуск
requires: Налог на продукт
requires: Услуги
term status: draft
definition: The goods and services account shows the balance between the total goods and services supplied as resources to the economy as output and imports (including the value of taxes less subsidies on products not already included in the valuation of output) and the use of the same goods and services as intermediate consumption, final consumption, capital formation and exports.
definition: Счет товаров и услуг показывает равенство между общей стоимостью товаров и услуг, поступивших в экономику страны в качестве ресурсов, таких как выпуск и импорт (включая стоимость налогов на продукты за вычетом субсидий на продукты, кроме уже включенных в оценку выпуска), и использованием этих товаров и услуг на промежуточное потребление, конечное потребление, накопление и экспорт.
in scheme: Глоссарий
preferred label: Goods and Services Account
related: Институциональный сектор
related: Товары
related: Промежуточное потребление
related: Операция
related: Потребление
related: Услуги
top concept of: Глоссарий

Лица, работающие по найму (наемные работники)
type: Concept
comment: Их вознаграждение отражается в СНС как оплата труда. Отношение работодателя и работника существует при наличии договора между работодателем и физическим лицом, который может быть формальным или неформальным и который обычно заключается добровольно обеими сторонами, в соответствии с которым физическое лицо работает для работодателя в обмен на вознаграждение в денежной или натуральной форме. Работодатель не обязан заявлять о договоре какому-либо официальному органу для регистрации статуса работника. Лица, работающие по найму, включают следующие категории, но не ограничиваются ими: лица, нанятые работодателем по договору найма (работники физического и умственного труда, управленческий персонал, домашняя прислуга, лица, занятые производственной деятельностью за вознаграждение по программам занятости) государственные служащие и другие работники органов государственного управления, сроки и условия занятости которых устанавливаются государственным законодательством служащие вооруженных сил, проходящие службу на долгосрочной и краткосрочной основе, а также призывники (включая призывников, работающих на гражданской службе) священнослужители, если они оплачиваются непосредственно органами государственного управления или некоммерческими организациями собственники корпораций и квазикорпораций, если они работают на этих предприятиях учащиеся, имеющие формальное обязательство, в соответствии с которым они вносят свой трудовой вклад в процесс производства на предприятии в обмен на вознаграждение и (или) услуги образования лица с ограниченными физическими возможностями при условии существования формального или неформального отношения между работодателем и работником лица, нанятые временными службами занятости, которые должны относиться к той же отрасли, что и нанявшая их служба, а не к отрасли, к которой принадлежит предприятие, для которого они фактически работают.
source: Система национальных счетов 2008
  source: https://stat.semanticpro.org/xwiki/wiki/NationalAccounts/view/%D0%91%D0%B8%D0%B1%D0%BB%D0%B8%D0%BE%D1%82%D0%B5%D0%BA%D0%B0/%D0%A1%D0%B8%D1%81%D1%82%D0%B5%D0%BC%D0%B0%20%D0%BD%D0%B0%D1%86%D0%B8%D0%BE%D…
requires: Институциональная единица
term status: draft
definition: Employees are persons who, by agreement, work for a resident institutional unit and receive remuneration for their labour.
definition: Лица, работающие по найму (наемные работники) — это лица, работающие по соглашению на институциональную единицу, являющуюся резидентом данной страны, и получающие вознаграждение за свой труд.
in scheme: Глоссарий
preferred label: Employees
related: Предприятие
related: Оплата труда
related: Квазикорпорация
related: Корпорация
related: Отрасль
related: Обязательство
related: Органы государственного управления
related: Услуги
related: Производство
top concept of: Глоссарий

Разведка и оценка запасов полезных ископаемых
type: Concept
comment: These expenditures include prelicence costs, licence and acquisition costs, appraisal costs and the costs of actual test drilling and boring, as well as the costs of aerial and other surveys, transportation costs, etc., incurred to make it possible to carry out the tests. Re-evaluations may take place after commercial exploitation of the reserve has started and the cost of these re-evaluations is also included in gross fixed capital formation.
comment: Эти расходы включают предварительные издержки до получения лицензии, издержки на приобретение лицензии, затраты на проведение оценки и пробного бурения, а также издержки на воздушную и иную картографическую съемку, транспортные расходы и т. д., понесенные на выполнение пробных тестов. Возможно, что после начала коммерческой эксплуатации потребуется проведение переоценки запасов, и издержки на проведение таких переоценок также включаются в валовое накопление основного капитала.
source: Система национальных счетов 2008
  source: https://stat.semanticpro.org/xwiki/wiki/NationalAccounts/view/%D0%91%D0%B8%D0%B1%D0%BB%D0%B8%D0%BE%D1%82%D0%B5%D0%BA%D0%B0/%D0%A1%D0%B8%D1%81%D1%82%D0%B5%D0%BC%D0%B0%20%D0%BD%D0%B0%D1%86%D0%B8%D0%BE%D…
requires: Запасы
term status: draft
definition: Mineral exploration and evaluation consists of the value of expenditures on exploration for petroleum and natural gas and for non-petroleum deposits and subsequent evaluation of the discoveries made.
definition: Разведка и оценка запасов полезных ископаемых включает стоимость расходов на разведывание запасов нефти и природного газа, запасов других полезных ископаемых и последующую оценку обнаруженных запасов.
in scheme: Глоссарий
preferred label: Mineral Exploration and Evaluation
related: Валовое накопление основного капитала
related: Запасы
top concept of: Глоссарий

Разрешение на занятие определенным видом деятельности
type: Concept
comment: Such permits are issued mainly by government but may also be issued by other units.
comment: Разрешения на занятие определенным видом деятельности выдаются, главным образом, органами государственного управления, но могут также выдаваться и другими единицами.
source: Система национальных счетов 2008
  source: https://stat.semanticpro.org/xwiki/wiki/NationalAccounts/view/%D0%91%D0%B8%D0%B1%D0%BB%D0%B8%D0%BE%D1%82%D0%B5%D0%BA%D0%B0/%D0%A1%D0%B8%D1%81%D1%82%D0%B5%D0%BC%D0%B0%20%D0%BD%D0%B0%D1%86%D0%B8%D0%BE%D…
requires: Актив
term status: draft
definition: A permit to undertake a specific activity is one where: the permits are limited in number and so allow the holders to earn monopoly profits, the monopoly profits do not come from the use of an asset belonging to the permit-issuer, c. a permit holder is able both legally and practically to sell the permit to a third party.
definition: Разрешение на занятие определенным видом деятельности имеет место, когда число разрешений ограничено и позволяет держателям разрешений зарабатывать монопольные прибыли, монопольные прибыли не связаны с использованием актива, принадлежащего тому, кто выдал разрешение, держатель разрешения в состоянии юридически и практически продать разрешение третьей стороне.
in scheme: Глоссарий
preferred label: Permit to Undertake a Specific Activity
related: Органы государственного управления
top concept of: Глоссарий

Основные фонды
type: Concept
comment: Отличительным признаком объекта основных фондов является не то, что он является долговечным в некотором физическом смысле, но то, что он может использоваться неоднократно или непрерывно в производстве в течение длительного периода времени, более длительного, чем один год. Некоторые товары, такие как уголь, могут быть очень долговечными в физическом смысле, но не могут считаться основными фондами, потому что они могут использоваться только однажды. Основные фонды включают не только сооружения, машины и оборудование, но также и культивируемые активы, такие как деревья или животные, которые используются неоднократно или непрерывно, чтобы производить другие продукты, например, фрукты или молочные продукты. Основные фонды также включают продукты интеллектуальной собственности, такие как компьютерное программное обеспечение или оригиналы художественных произведений, используемые в производстве.
source: Система национальных счетов 2008
  source: https://stat.semanticpro.org/xwiki/wiki/NationalAccounts/view/%D0%91%D0%B8%D0%B1%D0%BB%D0%B8%D0%BE%D1%82%D0%B5%D0%BA%D0%B0/%D0%A1%D0%B8%D1%81%D1%82%D0%B5%D0%BC%D0%B0%20%D0%BD%D0%B0%D1%86%D0%B8%D0%BE%D…
requires: Актив
requires: Производство
term status: draft
definition: Основные фонды — это произведенные активы, которые используются неоднократно или непрерывно в процессах производства более одного года.
definition: Fixed assets are produced assets that are used repeatedly or continuously in production processes for more than one year.
in scheme: Глоссарий
preferred label: Fixed Assets
related: Продукты
related: Товары
related: Машины и оборудование
related: Актив
related: Компьютерное программное обеспечение
related: Производство
top concept of: Глоссарий

Вертикально интегрированное предприятие
type: Concept
comment: Выпуск одной стадии производства используется в качестве затрат на следующей стадии, и только выпуск, произведенный на конечной стадии, фактически реализуется на рынке.
source: Система национальных счетов 2008
  source: https://stat.semanticpro.org/xwiki/wiki/NationalAccounts/view/%D0%91%D0%B8%D0%B1%D0%BB%D0%B8%D0%BE%D1%82%D0%B5%D0%BA%D0%B0/%D0%A1%D0%B8%D1%81%D1%82%D0%B5%D0%BC%D0%B0%20%D0%BD%D0%B0%D1%86%D0%B8%D0%BE%D…
requires: Предприятие
requires: Производство
term status: draft
alternative label: Вертикальная интеграция
broader: Предприятие
definition: A vertically integrated enterprise is one in which different stages of production, which are usually carried out by different enterprises, are carried out in succession by different parts of the same enterprise.
definition: Вертикально интегрированное предприятие — это предприятие, в котором различные стадии производства, обычно осуществляемые разными предприятиями, выполняются последовательно разными подразделениями того же самого предприятия.
in scheme: Глоссарий
preferred label: Vertically Integrated Enterprise
related: Выпуск
related: Производство
top concept of: Глоссарий

Социальные пособия
type: Concept
source: Система национальных счетов 2008
  source: https://stat.semanticpro.org/xwiki/wiki/NationalAccounts/view/%D0%91%D0%B8%D0%B1%D0%BB%D0%B8%D0%BE%D1%82%D0%B5%D0%BA%D0%B0/%D0%A1%D0%B8%D1%81%D1%82%D0%B5%D0%BC%D0%B0%20%D0%BD%D0%B0%D1%86%D0%B8%D0%BE%D…
requires: Текущий трансферт
requires: Домашнее хозяйство
requires: Услуги
term status: draft
definition: Социальные пособия — это текущие трансферты, получаемые домашними хозяйствами для удовлетворения потребностей, возникающих при наступлении определенных событий или обстоятельств, например, таких как болезни, безработица, выход на пенсию, необходимость оплаты жилищных услуг, образования или при определенных семейных обстоятельствах.
definition: Social benefits are current transfers received by households intended to provide for the needs that arise from certain events or circumstances, for example, sickness, unemployment, retirement, housing, education or family circumstances.
in scheme: Глоссарий
preferred label: Social Benefits
top concept of: Глоссарий

Некоммерческие организации, обслуживающие домашние хозяйства
type: Concept
comment: Они предоставляют товары и услуги домашним хозяйствам бесплатно или по экономически незначимым ценам. Большая часть этих товаров и услуг представляют собой индивидуальное потребление, но НКОДХ могут предоставлять и коллективные услуги.
requires: Органы государственного управления
requires: Некоммерческие организации
term status: draft
alternative label: НКОДХ
broader: Институциональный сектор
definition: Некоммерческие организации, обслуживающие домашние хозяйства (НКОДХ), состоят из нерыночных НКО, которые не контролируются органами государственного управления.
definition: Non-profit institutions serving households (NPISHs) consist of non-market NPIs that are not controlled by government.
in scheme: Глоссарий
preferred label: Non-profit institutions serving households
related: Цена
related: Товары
related: Потребление
related: Домашнее хозяйство
related: Услуги
top concept of: Глоссарий

Торговые прибыли или убытки вследствие изменений в условиях внешней торговли
type: Concept
source: Система национальных счетов 2008
  source: https://stat.semanticpro.org/xwiki/wiki/NationalAccounts/view/%D0%91%D0%B8%D0%B1%D0%BB%D0%B8%D0%BE%D1%82%D0%B5%D0%BA%D0%B0/%D0%A1%D0%B8%D1%81%D1%82%D0%B5%D0%BC%D0%B0%20%D0%BD%D0%B0%D1%86%D0%B8%D0%BE%D…
requires: Реальный валовой внутренний доход
requires: Цена
requires: Валовый внутренний продукт
term status: draft
definition: Торговые прибыли или убытки вследствие изменений в условиях внешней торговли — это разница между показателем реального ВВД и показателем объема ВВП в ценах базисного периода.
definition: The trading gain or loss from changes in the terms of trade is the difference between real GDI and GDP in volume terms.
in scheme: Глоссарий
preferred label: Trading Gain Or Loss
top concept of: Глоссарий

Горизонтально интегрированное предприятие
type: Concept
comment: Горизонтальная интеграция имеет место, когда результатом деятельности становятся конечные продукты с различными характеристиками. Теоретически это может толковаться как виды деятельности, осуществляемые одновременно с использованием одних и тех же факторов производства, и в этом случае часто не представляется возможным статистически подразделить такие виды деятельности на отдельные процессы, распределить их по разным единицам или обычно представить по ним отдельные данные. Другим примером является выработка электроэнергии посредством сжигания отходов. В этом случае деятельность по утилизации отходов и деятельность по выработке электроэнергии невозможно отделить друг от друга.
source: Система национальных счетов 2008
  source: https://stat.semanticpro.org/xwiki/wiki/NationalAccounts/view/%D0%91%D0%B8%D0%B1%D0%BB%D0%B8%D0%BE%D1%82%D0%B5%D0%BA%D0%B0/%D0%A1%D0%B8%D1%81%D1%82%D0%B5%D0%BC%D0%B0%20%D0%BD%D0%B0%D1%86%D0%B8%D0%BE%D…
requires: Предприятие
requires: Товары
requires: Производство
requires: Услуги
term status: draft
alternative label: Горизонтальная интеграция
broader: Предприятие
definition: Горизонтально интегрированное предприятие — это такое предприятие, в котором несколько различных видов деятельности, производящих различные виды товаров и услуг для продажи на рынке, осуществляются одновременно, используя те же самые факторы производства.
definition: A horizontally integrated enterprise is one in which several different kinds of activities that produce different kinds of goods or services for sale on the market are carried out in parallel with each other.
in scheme: Глоссарий
preferred label: Horizontally Integrated Enterprise
related: Продукты
related: Производство
top concept of: Глоссарий

Цена
type: Concept
comment: Она зависит от размера единицы измерения выбранного количества и во многих случаях может меняться в зависимости от изменения единицы измерения количества, например, в связи с решением измерять количество в тоннах, а не в килограммах. Цены, как и количества, не являются аддитивными для различных товаров или услуг. Среднее значение цен различных товаров или услуг не имеет экономического смысла и не может использоваться, чтобы определить изменение цен за некоторый период времени.
source: Система национальных счетов 2008
  source: https://stat.semanticpro.org/xwiki/wiki/NationalAccounts/view/%D0%91%D0%B8%D0%B1%D0%BB%D0%B8%D0%BE%D1%82%D0%B5%D0%BA%D0%B0/%D0%A1%D0%B8%D1%81%D1%82%D0%B5%D0%BC%D0%B0%20%D0%BD%D0%B0%D1%86%D0%B8%D0%BE%D…
requires: Товары
requires: Услуги
term status: draft
definition: Цена товара или услуги определяется как стоимость единицы данного товара или услуги.
definition: The price of a good or service is defined as the value of one unit of that good or service
in scheme: Глоссарий
preferred label: Price
related: Товары
related: Услуги
top concept of: Глоссарий

Оплата труда
type: Concept
comment: Существуют только два основных вида расходов, которые производители должны вычесть из добавленной стоимости, а именно - оплата труда, подлежащая выплате наемным работникам за их участие в производстве, и любые суммы налогов на производство за вычетом субсидий, подлежащих выплате органам государственного управления.
source: Система национальных счетов 2008
  source: https://stat.semanticpro.org/xwiki/wiki/NationalAccounts/view/%D0%91%D0%B8%D0%B1%D0%BB%D0%B8%D0%BE%D1%82%D0%B5%D0%BA%D0%B0/%D0%A1%D0%B8%D1%81%D1%82%D0%B5%D0%BC%D0%B0%20%D0%BD%D0%B0%D1%86%D0%B8%D0%BE%D…
requires: Предприятие
term status: draft
definition: Оплата труда лиц, работающих по найму, определяется как общая сумма вознаграждения в денежной или в натуральной форме, подлежащая выплате предприятием работнику за проделанную им работу в течение отчетного периода.
definition: Compensation of employees is defined as the total remuneration, in cash or in kind, payable by an enterprise to an employee in return for work done by the latter during the accounting period.
in scheme: Глоссарий
preferred label: Compensation of Employees
related: Налоги
related: Субсидии
related: Органы государственного управления
related: Производство
top concept of: Глоссарий

Форвардный контракт
type: Concept
comment: Under a forward contract, the two counterparties agree to exchange a specified quantity of an underlying item (a particular product or financial asset) at an agreed contract price (the “strike” price) on a specified date.
comment: Согласно форвардному контракту две стороны сделки соглашаются обменять определенное количество лежащего в его основе объекта (конкретного продукта или финансового актива) по согласованной договорной цене (цене исполнения) на определенную дату.
source: Система национальных счетов 2008
  source: https://stat.semanticpro.org/xwiki/wiki/NationalAccounts/view/%D0%91%D0%B8%D0%B1%D0%BB%D0%B8%D0%BE%D1%82%D0%B5%D0%BA%D0%B0/%D0%A1%D0%B8%D1%81%D1%82%D0%B5%D0%BC%D0%B0%20%D0%BD%D0%B0%D1%86%D0%B8%D0%BE%D…
requires: Обязательство
term status: draft
definition: A forward contract is an unconditional financial contract that represents an obligation for settlement on a specified date.
definition: Форвардный контракт является финансовым контрактом, который представляет собой безусловное обязательство, которое должно быть урегулировано на определенную дату. Расчеты по фьючерсам и другим форвардным контрактам обычно, но не всегда, осуществляются выплатой наличных денег или предоставлением некоторого другого финансового инструмента, а не фактической поставкой лежащего в основе контракта объекта, и поэтому эти контракты оцениваются и обращаются отдельно от лежащего в основе контракта объекта.
in scheme: Глоссарий
preferred label: Forward Contract
related: Продукты
related: Финансовые активы
top concept of: Глоссарий

Вексель
type: Concept
comment: Векселя выпускают и ими обычно торгуют на организованных рынках со скидками к номинальной стоимости, которые зависят от процентной ставки и сроков погашения.
source: Система национальных счетов 2008
  source: https://stat.semanticpro.org/xwiki/wiki/NationalAccounts/view/%D0%91%D0%B8%D0%B1%D0%BB%D0%B8%D0%BE%D1%82%D0%B5%D0%BA%D0%B0/%D0%A1%D0%B8%D1%81%D1%82%D0%B5%D0%BC%D0%B0%20%D0%BD%D0%B0%D1%86%D0%B8%D0%BE%D…
requires: Ценные бумаги
term status: draft
broader: Ценные бумаги
definition: Bills are defined as securities that give the holders the unconditional rights to receive stated fixed sums on a specified date.
definition: Векселя — ценные бумаги, которые обеспечивают их держателям безусловное право получить определенную фиксированную сумму на конкретную установленную дату.
in scheme: Глоссарий
preferred label: Bills
top concept of: Глоссарий

Занятые лица
type: Concept
comment: Лица, работающие по найму, включают следующие категории, но не ограничиваются ими лица, нанятые работодателем по договору найма (работники физического и умственного труда, управленческий персонал, домашняя прислуга, лица, занятые производственной деятельностью за вознаграждение по программам занятости) государственные служащие и другие работники органов государственного управления, сроки и условия занятости которых устанавливаются государственным законодательством служащие вооруженных сил, проходящие службу на долгосрочной и краткосрочной основе, а также призывники (включая призывников, работающих на гражданской службе) священнослужители, если они оплачиваются непосредственно органами государственного управления или некоммерческими организациями собственники корпораций и квазикорпораций, если они работают на этих предприятиях учащиеся, имеющие формальное обязательство, в соответствии с которым они вносят свой трудовой вклад в процесс производства на предприятии в обмен на вознаграждение и (или) услуги образования лица с ограниченными физическими возможностями при условии существования формального или неформального отношения между работодателем и работником лица, нанятые временными службами занятости, которые должны относиться к той же отрасли, что и нанявшая их служба, а не к отрасли, к которой принадлежит предприятие, для которого они фактически работают. Самостоятельно занятые лица включают следующие категории: помогающие члены семьи, работающие в некорпорированных предприятиях надомники, чей доход зависит от стоимости продукции какого-либо процесса производства, за который они несут ответственность; при этом не имеет значения, много или мало работы они выполнили лица, занятые в производстве, предпринимаемом полностью для их собственного конечного потребления или накопления на индивидуальной или коллективной основе.
source: Система национальных счетов 2008
  source: https://stat.semanticpro.org/xwiki/wiki/NationalAccounts/view/%D0%91%D0%B8%D0%B1%D0%BB%D0%B8%D0%BE%D1%82%D0%B5%D0%BA%D0%B0/%D0%A1%D0%B8%D1%81%D1%82%D0%B5%D0%BC%D0%B0%20%D0%BD%D0%B0%D1%86%D0%B8%D0%BE%D…
requires: Институциональная единица
requires: Границы сферы производства в СНС
requires: Самостоятельно занятые лица
requires: Производство
term status: draft
definition: Employment is defined as all persons, both employees and self-employed persons, engaged in some productive activity that falls within the production boundary of the SNA.
definition: Занятые лица в СНС определяются как совокупность всех лиц, как работающих по найму, так и самостоятельно занятых лиц, занимающихся каким-либо видом производственной деятельности, который подпадает под определение границ сферы производства в СНС и осуществляется институциональной единицей-резидентом.
in scheme: Глоссарий
preferred label: Employment
related: Предприятие
related: Продукты
related: Квазикорпорация
related: Корпорация
related: Отрасль
related: Потребление
related: Обязательство
related: Органы государственного управления
related: Производство
related: Услуги
top concept of: Глоссарий

Процент
type: Concept
source: Система национальных счетов 2008
  source: https://stat.semanticpro.org/xwiki/wiki/NationalAccounts/view/%D0%91%D0%B8%D0%B1%D0%BB%D0%B8%D0%BE%D1%82%D0%B5%D0%BA%D0%B0/%D0%A1%D0%B8%D1%81%D1%82%D0%B5%D0%BC%D0%B0%20%D0%BD%D0%B0%D1%86%D0%B8%D0%BE%D…
requires: Долговые ценные бумаги
requires: Институциональная единица
requires: Финансовые активы
requires: Ссуды
term status: draft
definition: Interest is a form of income that is receivable by the owners of certain kinds of financial assets, namely deposits, debt securities, loans and (possibly) other accounts receivable for putting the financial asset at the disposal of another institutional unit.
definition: Процент — это форма дохода, подлежащего получению собственниками определенных видов финансовых активов, а именно депозитов, долговых ценных бумаг, ссуд и (возможно) дебиторской задолженности, за предоставление финансового актива в распоряжение другой институциональной единицы.
in scheme: Глоссарий
preferred label: Interest
top concept of: Глоссарий

Резервы для урегулирования требований
type: Concept
comment: Операции, отражаемые в финансовом счете для резервов для урегулирования требований по программам стандартизированных гарантий, аналогичны операциям для страховых технических резервов (кроме резервов по страхованию жизни); они включают незаработанные платежи и неурегулированные требования.
comment: The transactions for provisions for calls under standardized guarantee schemes recorded in the financial account are similar to the reserves for non-life insurance; they include unearned fees and calls not yet settled.
source: Система национальных счетов 2008
  source: https://stat.semanticpro.org/xwiki/wiki/NationalAccounts/view/%D0%91%D0%B8%D0%B1%D0%BB%D0%B8%D0%BE%D1%82%D0%B5%D0%BA%D0%B0/%D0%A1%D0%B8%D1%81%D1%82%D0%B5%D0%BC%D0%B0%20%D0%BD%D0%B0%D1%86%D0%B8%D0%BE%D…
term status: draft
definition: Резервы для урегулирования требований по стандартизированным гарантиям состоят из предварительных чистых платежей и резервов, необходимых для покрытия неурегулированных требований по стандартизированным гарантиям.
definition: Provisions for calls under standardized guarantees consist of prepayments of net fees and provisions to meet outstanding calls under standardized guarantees.
in scheme: Глоссарий
preferred label: Provisions for Calls Under Standardized Guarantees
related: Страховые технические резервы
related: Операция
related: Страхование жизни
top concept of: Глоссарий

Валютно-обменный своп
type: Concept
source: Система национальных счетов 2008
  source: https://stat.semanticpro.org/xwiki/wiki/NationalAccounts/view/%D0%91%D0%B8%D0%B1%D0%BB%D0%B8%D0%BE%D1%82%D0%B5%D0%BA%D0%B0/%D0%A1%D0%B8%D1%81%D1%82%D0%B5%D0%BC%D0%B0%20%D0%BD%D0%B0%D1%86%D0%B8%D0%BE%D…
term status: draft
definition: A foreign exchange swap is a spot sale/purchase of currencies and a simultaneous forward purchase/sale of the same currencies.
definition: Валютно-обменный своп является наличной продажей/покупкой через кассу одной валюты и одновременно форвардной покупкой/продажей этой же валюты.
in scheme: Глоссарий
preferred label: Foreign Exchange Swap
top concept of: Глоссарий

Нераспределенный доход корпорации или квазикорпорации
type: Concept
source: Система национальных счетов 2008
  source: https://stat.semanticpro.org/xwiki/wiki/NationalAccounts/view/%D0%91%D0%B8%D0%B1%D0%BB%D0%B8%D0%BE%D1%82%D0%B5%D0%BA%D0%B0/%D0%A1%D0%B8%D1%81%D1%82%D0%B5%D0%BC%D0%B0%20%D0%BD%D0%B0%D1%86%D0%B8%D0%BE%D…
requires: Дивиденды
requires: Квазикорпорация
requires: Корпорация
term status: draft
definition: Retained earnings of a corporation or quasi-corporation are equal to the distributable income less the dividends payable or withdrawal of income from the quasi-corporation respectively.
definition: Нераспределенный доход корпорации или квазикорпорации равен доходу, подлежащему распределению, минус дивиденды, подлежащие выплате, или изъятие из дохода корпорации или квазикорпорации, соответственно.
in scheme: Глоссарий
preferred label: Retained Earnings of a Corporation or Quasi-Corporation
top concept of: Глоссарий

Налоги на производство, подлежащие выплате
type: Concept
comment: Налоги на производство не включают любые налоги на доходы, уплачиваемые получателями доходов, поступающих в связи с участием в производстве, независимо от того, являются ли они работодателями или наемными работниками.
source: Система национальных счетов 2008
  source: https://stat.semanticpro.org/xwiki/wiki/NationalAccounts/view/%D0%91%D0%B8%D0%B1%D0%BB%D0%B8%D0%BE%D1%82%D0%B5%D0%BA%D0%B0/%D0%A1%D0%B8%D1%81%D1%82%D0%B5%D0%BC%D0%B0%20%D0%BD%D0%B0%D1%86%D0%B8%D0%BE%D…
requires: Рабочая сила
requires: Выпуск
requires: Налог на продукт
requires: Актив
requires: Производство
requires: Другие налоги на производство
term status: draft
broader: Налоги
definition: Taxes less subsidies on production consist of taxes payable or subsidies receivable on goods or services produced as outputs and other taxes or subsidies on production, such as those payable on the labour, machinery, buildings or other assets used in production.
definition: Налоги на производство, подлежащие выплате, включают налоги на продукты, производимые в качестве выпуска, а также другие налоги на производство в связи с использованием в производстве рабочей силы, машин, оборудования и других активов.
in scheme: Глоссарий
preferred label: Taxes Less Subsidies on Production
related: Налоги на доходы
related: Производство
top concept of: Глоссарий

Непроизведенные активы
type: Concept
source: Система национальных счетов 2008
  source: https://stat.semanticpro.org/xwiki/wiki/NationalAccounts/view/%D0%91%D0%B8%D0%B1%D0%BB%D0%B8%D0%BE%D1%82%D0%B5%D0%BA%D0%B0/%D0%A1%D0%B8%D1%81%D1%82%D0%B5%D0%BC%D0%B0%20%D0%BD%D0%B0%D1%86%D0%B8%D0%BE%D…
requires: Контракты, договоры аренды и лицензии
requires: Гудвилл и маркетинговые активы
requires: Природные ресурсы
term status: draft
definition: Непроизведенные активы состоят из трех категорий: i ) природные ресурсы; ii) контракты, договоры аренды и лицензии; iii) приобретенный гудвилл и маркетинговые активы.
definition: Non-produced assets consist of three categories: (i) natural resources, (ii) contracts, leases and licences, and (iii) purchased goodwill and marketing assets.
in scheme: Глоссарий
preferred label: Non-Produced Assets
top concept of: Глоссарий

Материальные оборотные средства
type: Concept
comment: Inventories consist of stocks of outputs that are still held by the units that produced them prior to their being further processed, sold, delivered to other units or used in other ways and stocks of products acquired from other units that are intended to be used for intermediate consumption or for resale without further processing. Inventories of services consist of workin-progress or finished products, for example architectural drawings, which are in the process of completion or are completed and waiting for the building to which they relate to be started. Inventories held by government include, but are not limited to, inventories of strategic materials, and grain and other commodities of special importance to the nation.
comment: Материальные оборотные средства включают запасы произведенных продуктов, которые все еще находятся у единиц, изготовивших их, для дальнейшей обработки, продажи, передачи другим единицам или использования другими способами, и запасы продуктов, приобретенных у других единиц, предназначенных для использования на цели промежуточного потребления или для перепродажи без последующей обработки. Услуги как элемент материальных оборотных средств состоят из незавершенного производства или готовых продуктов, например, таких как архитектурные чертежи, которые находятся в процессе завершения или закончены и будут находиться в запасах до начала строительства здания, к которому они имеют отношение. Материальные оборотные средства, находящиеся у органов государственного управления, включают запасы стратегических материалов, зерна и других товаров, имеющих особую важность для страны (но не ограничиваются этим).
source: Система национальных счетов 2008
  source: https://stat.semanticpro.org/xwiki/wiki/NationalAccounts/view/%D0%91%D0%B8%D0%B1%D0%BB%D0%B8%D0%BE%D1%82%D0%B5%D0%BA%D0%B0/%D0%A1%D0%B8%D1%81%D1%82%D0%B5%D0%BC%D0%B0%20%D0%BD%D0%B0%D1%86%D0%B8%D0%BE%D…
requires: Товары
requires: Актив
requires: Производство
requires: Услуги
term status: draft
definition: Inventories are produced assets that consist of goods and services, which came into existence in the current period or in an earlier period, and that are held for sale, use in production or other use at a later date.
definition: Материальные оборотные средства — это произведенные активы, состоящие из товаров и услуг, которые появились в текущем периоде или более раннем периоде и которые предназначены для продажи, использования в производстве или для других видов использования позднее.
in scheme: Глоссарий
preferred label: Inventories
related: Продукты
related: Запасы
related: Товары
related: Промежуточное потребление
related: Незавершенное производство
related: Услуги
top concept of: Глоссарий

Текущий трансферт
type: Concept
comment: Текущие трансферты могут иметь место как между резидентами и нерезидентами, так и между институциональными единицами-резидентами. В счете вторичного распределения доходов различают следующие три основных вида текущих трансфертов: текущие налоги на доходы, налоги на имущество и т. д.; отчисления на социальное страхование и социальные пособия; другие текущие трансферты.
source: Система национальных счетов 2008
  source: https://stat.semanticpro.org/xwiki/wiki/NationalAccounts/view/%D0%91%D0%B8%D0%B1%D0%BB%D0%B8%D0%BE%D1%82%D0%B5%D0%BA%D0%B0/%D0%A1%D0%B8%D1%81%D1%82%D0%B5%D0%BC%D0%B0%20%D0%BD%D0%B0%D1%86%D0%B8%D0%BE%D…
requires: Товары
requires: Институциональная единица
requires: Операция
requires: Обязательство
requires: Актив
requires: Услуги
term status: draft
broader: Трансферт
definition: A current transfer is a transaction in which one institutional unit provides a good, service or asset to another unit without receiving from the latter any good, service or asset directly in return as counterpart and does not oblige one or both parties to acquire, or dispose of, an asset.
definition: Текущий трансферт представляет собой экономическую операцию, в результате которой одна институциональная единица предоставляет другой единице товар, услугу или актив, не получая от нее взамен какого-либо товара, услуги или актива в качестве эквивалента, и которая не предполагает обязательств одной стороны или обеих сторон приобрести или реализовать актив.
in scheme: Глоссарий
preferred label: Current Transfer
related: Отчисления на социальное страхование
related: Институциональная единица
related: Текущие налоги на доходы, имущество и т. д.
related: Социальные пособия
related: Другие текущие трансферты
top concept of: Глоссарий

Другие здания и сооружения
type: Concept
comment: Нежилые здания включают все здания или части зданий, не предназначенные для использования в качестве жилых помещений. Включаются арматура, устройства и оборудование, которые являются неотъемлемой частью сооружений. Другие сооружения включают сооружения, кроме зданий, такие как улицы, канализационные системы и т. д. Такую деятельность, как расчистка земли, изменение рельефа, сооружение колодцев и водяных скважин, которые являются неотъемлемой частью участка земли, следует рассматривать как имеющую своим результатом улучшения земли. Такая деятельность, как создание волнорезов, плотин, дамб и ирригационных систем, расположенных вблизи участка земли, но не являющихся его неотъемлемой частью, которые часто влияют на участки земли, принадлежащие нескольким собственникам, часто осуществляется органом государственного управления и воплощается в активах, которые следует классифицировать как сооружения.
source: Система национальных счетов 2008
  source: https://stat.semanticpro.org/xwiki/wiki/NationalAccounts/view/%D0%91%D0%B8%D0%B1%D0%BB%D0%B8%D0%BE%D1%82%D0%B5%D0%BA%D0%B0/%D0%A1%D0%B8%D1%81%D1%82%D0%B5%D0%BC%D0%B0%20%D0%BD%D0%B0%D1%86%D0%B8%D0%BE%D…
requires: Улучшения земли
requires: Нежилые здания
requires: Другие сооружения
term status: draft
definition: Other buildings and structures comprise non-residential buildings, other structures and land improvements.
definition: Другие здания и сооружения включают нежилые здания, другие сооружения и улучшения земли.
in scheme: Глоссарий
preferred label: Other Buildings and Structures
related: Улучшения земли
related: Земля
related: Органы государственного управления
related: Актив
related: Другие сооружения
related: Нежилые здания
top concept of: Глоссарий

Валовая добавленная стоимость в основных ценах
type: Concept
comment: Although the outputs and inputs are valued using different sets of prices, for brevity the value added is described by the prices used to value the outputs. From the point of view of the producer, purchasers’ prices for inputs and basic prices for outputs represent the prices actually paid and received. Their use leads to a measure of gross value added that is particularly relevant for the producer.
comment: Хотя выпуски и затраты оценены в раз личных наборах цен, для краткости валовая добавленная стоимость называется в соответствии с ценами, используемыми для оценки выпуска. С точки зрения производителя цены покупателей, используемые для оценки промежуточного потребления, и основные цены, используемые для оценки выпуска, представляют собой цены, которые фактически оплачены и получены. Их использование позволяет получить измерение добавленной стоимости, которое является наиболее адекватным для производителя.
source: Система национальных счетов 2008
  source: https://stat.semanticpro.org/xwiki/wiki/NationalAccounts/view/%D0%91%D0%B8%D0%B1%D0%BB%D0%B8%D0%BE%D1%82%D0%B5%D0%BA%D0%B0/%D0%A1%D0%B8%D1%81%D1%82%D0%B5%D0%BC%D0%B0%20%D0%BD%D0%B0%D1%86%D0%B8%D0%BE%D…
requires: Цена покупателя
requires: Промежуточное потребление
requires: Выпуск
requires: Основная цена
term status: draft
alternative label: GVA at Basic Prices
definition: Gross value added at basic prices is defined as output valued at basic prices less intermediate consumption valued at purchasers’ prices.
definition: Валовая добавленная стоимость в основных ценах определяется как выпуск, оцененный в основных ценах, минус промежуточное потребление, оцененное в ценах покупателей.
in scheme: Глоссарий
preferred label: Gross Value Added at Basic Prices
related: Цена
related: Цена производителя
related: Промежуточное потребление
related: Выпуск
top concept of: Глоссарий

Совместное предприятие
type: Concept
comment: The units operate in the same way as other units except that a legal arrangement between the parties establishes joint control over the unit. As an institutional unit, the joint venture may enter into contracts in its own name and raise finance for its own purposes. A joint venture maintains its own accounting records.
comment: Эти единицы функционируют таким же образом, как и другие единицы, за исключением того, что совместный контроль над единицей устанавливается на основе юридического договора между сторонами. В качестве институциональной единицы совместное предприятие может заключать контракты от своего имени и обеспечивать финансирование для собственных целей. Совместное предприятие ведет свой собственный бухгалтерский учет.
source: Система национальных счетов 2008
  source: https://stat.semanticpro.org/xwiki/wiki/NationalAccounts/view/%D0%91%D0%B8%D0%B1%D0%BB%D0%B8%D0%BE%D1%82%D0%B5%D0%BA%D0%B0/%D0%A1%D0%B8%D1%81%D1%82%D0%B5%D0%BC%D0%B0%20%D0%BD%D0%B0%D1%86%D0%B8%D0%BE%D…
requires: Институциональная единица
requires: Корпорация
term status: draft
definition: A joint venture involves the establishment of a corporation, partnership or other institutional unit in which each party legally has joint control over the activities of the unit.
definition: Совместное предприятие предполагает учреждение корпорации, партнерства или иной институциональной единицы, в которой каждая сторона на законных основаниях может осуществлять совместный с другими сторонами контроль над деятельностью данной единицы.
in scheme: Глоссарий
preferred label: Joint Venture
related: Институциональная единица
top concept of: Глоссарий

Товары для перепродажи
type: Concept
source: Система национальных счетов 2008
  source: https://stat.semanticpro.org/xwiki/wiki/NationalAccounts/view/%D0%91%D0%B8%D0%B1%D0%BB%D0%B8%D0%BE%D1%82%D0%B5%D0%BA%D0%B0/%D0%A1%D0%B8%D1%81%D1%82%D0%B5%D0%BC%D0%B0%20%D0%BD%D0%B0%D1%86%D0%B8%D0%BE%D…
requires: Предприятие
requires: Товары
term status: draft
broader: Товары
definition: Goods for resale are goods acquired by enterprises, such as wholesalers or retailers, for the purpose of reselling them to their customers.
definition: Товары для перепродажи — это товары, приобретенные предприятиями, такими как предприятия оптовой или розничной торговли, с целью их перепродажи клиентам.
in scheme: Глоссарий
preferred label: Goods For Resale
top concept of: Глоссарий

Расходы на конечное потребление домашних хозяйств
type: Concept
comment: Расходы на конечное потребление домашних хозяйств включают оценки стоимости товаров или услуг, произведенных некорпорированными предприятиями, принадлежащими домашним хозяйствам, которые использованы для потребления членами домашних хозяйств. Производство услуг для собственного потребления в пределах тех же самых домашних хозяйств не включается в границы сферы производства в СНС за исключением жилищных услуг, произведенных жильцами-владельцами, и услуг, произведенных оплачиваемой домашней прислугой.
source: Система национальных счетов 2008
  source: https://stat.semanticpro.org/xwiki/wiki/NationalAccounts/view/%D0%91%D0%B8%D0%B1%D0%BB%D0%B8%D0%BE%D1%82%D0%B5%D0%BA%D0%B0/%D0%A1%D0%B8%D1%81%D1%82%D0%B5%D0%BC%D0%B0%20%D0%BD%D0%B0%D1%86%D0%B8%D0%BE%D…
requires: Цена
requires: Товары
requires: Домашнее хозяйство
requires: Потребление
requires: Услуги
requires: Потребительские товары и услуги
term status: draft
broader: Расходы на конечное потребление
definition: Расходы на конечное потребление домашних хозяйств состоят из расходов (включая расходы, стоимость которых должна быть оценена косвенным образом), понесенных домашними хозяйствами — резидентами данной страны — на товары и услуги индивидуального потребления, включая купленные по ценам, которые не являются экономически значимыми, и включая потребительские товары и услуги, приобретенные за границей.
definition: Household final consumption expenditure consists of the expenditure, including expenditure whose value must be estimated indirectly, incurred by resident households on individual consumption goods and services, including those sold at prices that are not economically significant and including consumption goods and services acquired abroad.
in scheme: Глоссарий
preferred label: Household Final Consumption Expenditure
related: Предприятие
related: Товары
related: Границы сферы производства в СНС
related: Домашнее хозяйство
related: Потребление
related: Услуги
related: Производство
top concept of: Глоссарий

Услуга коллективного потребления
type: Concept
source: Система национальных счетов 2008
  source: https://stat.semanticpro.org/xwiki/wiki/NationalAccounts/view/%D0%91%D0%B8%D0%B1%D0%BB%D0%B8%D0%BE%D1%82%D0%B5%D0%BA%D0%B0/%D0%A1%D0%B8%D1%81%D1%82%D0%B5%D0%BC%D0%B0%20%D0%BD%D0%B0%D1%86%D0%B8%D0%BE%D…
requires: Домашнее хозяйство
requires: Услуги
term status: draft
definition: Услуга коллективного потребления — это услуга, предоставляемая одновременно всем членам общества в целом или всем членам отдельной части общества, таким как все домашние хозяйства в конкретном районе.
definition: A collective consumption service is a service provided simultaneously to all members of the community or to all members of a particular section of the community, such as all households living in a particular region.
in scheme: Глоссарий
preferred label: Collective Consumption Service
top concept of: Глоссарий

Другие финансовые корпорации
type: Concept
comment: Они включают страховые корпорации и пенсионные фонды. Вспомогательные финансовые корпорации представляют собой институциональные единицы, которые в основном заняты обслуживанием финансовых рынков, но не приобретают в собственность финансовые активы и обязательства, с которыми они имеют дело. Другие финансовые корпорации представляют собой институциональные единицы, предоставляющие финансовые услуги, при этом основная часть их активов и обязательств не продается на открытых финансовых рынках.
comment: Финансовые корпорации могут быть подразделены на три широкие категории, а именно: финансовые посредники, вспомогательные финансовые корпорации и другие финансовые корпорации.
source: Система национальных счетов 2008
  source: https://stat.semanticpro.org/xwiki/wiki/NationalAccounts/view/%D0%91%D0%B8%D0%B1%D0%BB%D0%B8%D0%BE%D1%82%D0%B5%D0%BA%D0%B0/%D0%A1%D0%B8%D1%81%D1%82%D0%B5%D0%BC%D0%B0%20%D0%BD%D0%B0%D1%86%D0%B8%D0%BE%D…
source: Система национальных счетов 2008
  source: https://stat.semanticpro.org/xwiki/wiki/NationalAccounts/view/%D0%91%D0%B8%D0%B1%D0%BB%D0%B8%D0%BE%D1%82%D0%B5%D0%BA%D0%B0/%D0%A1%D0%B8%D1%81%D1%82%D0%B5%D0%BC%D0%B0%20%D0%BD%D0%B0%D1%86%D0%B8%D0%BE%D…
requires: Институциональная единица
requires: Финансовые активы
requires: Операция
requires: Обязательство
requires: Актив
requires: Услуги
term status: draft
broader: Институциональная единица
definition: Другие финансовые корпорации представляют собой институциональные единицы, предоставляющие финансовые услуги, при этом основная часть их активов и обязательств не продается на открытых финансовых рынках.
definition: Other financial corporations are institutional units providing financial services, where most of their assets or liabilities are not available on open financial markets.
definition: Финансовые посредники представляют собой институциональные единицы, которые принимают обязательства от своего имени с целью приобретения финансовых активов путем осуществления финансовых операций на рынке.
in scheme: Глоссарий
preferred label: Финансовые посредники
preferred label: Other Financial Corporations
related: Финансовые корпорации
related: Институциональная единица
related: Корпорация
related: Вспомогательные финансовые корпорации
related: Обязательство
related: Актив
related: Услуги
top concept of: Глоссарий

Земля
type: Concept
comment: Стоимость земли не включает: стоимость любых зданий или других сооружений, расположенных на ней или проходящих через нее; стоимость сельскохозяйственных культур, деревьев и животных; стоимость <a target="_blank" rel="noopener noreferrer" href="https://stat.semanticpro.org/xwiki/wiki/NationalAccounts/view/%D0%93%D0%BB%D0%BE%D1%81%D1%81%D0%B0%D1%80%D0%B8%D0%B8/%D0%A0%D0%B5%D1%81%D1%83%D1%80%D1%81%D1%8B%20%D0%BC%D0%B8%D0%BD%D0%B5%D1%80%D0%B0%D0%BB%D1%8C%D0%BD%D1%8B%D1%85%20%D0%B8%20%D1%8D%D0%BD%D0%B5%D1%80%D0%B3%D0%B5%D1%82%D0%B8%D1%87%D0%B5%D1%81%D0%BA%D0%B8%D1%85%20%D0%BF%D0%BE%D0%BB%D0%B5%D0%B7%D0%BD%D1%8B%D1%85%20%D0%B8%D1%81%D0%BA%D0%BE%D0%BF%D0%B0%D0%B5%D0%BC%D1%8B%D1%85/">ресурсов минеральных и энергетических полезных ископаемых; стоимость некультивируемых биологических ресурсов и водных ресурсов под поверхностью земли. Поверхностные воды включают любые внутренние водоемы (водохранилища, озера, реки и т. д.), на которые могут быть установлены права собственности и которые по этой причине могут быть предметом операций между институциональными единицами. Однако резервуары воды, из которых вода регулярно извлекается за плату для использования в производстве (включая цели орошения), классифицируются не как вода, связанная с землей, а как водные ресурсы.
source: Система национальных счетов 2008
  source: https://stat.semanticpro.org/xwiki/wiki/NationalAccounts/view/%D0%91%D0%B8%D0%B1%D0%BB%D0%B8%D0%BE%D1%82%D0%B5%D0%BA%D0%B0/%D0%A1%D0%B8%D1%81%D1%82%D0%B5%D0%BC%D0%B0%20%D0%BD%D0%B0%D1%86%D0%B8%D0%BE%D…
term status: draft
definition: Земля состоит из земельного участка, включая почвенный покров и любые связанные с ним поверхностные воды, на который установлены права собственности и от которого их собственниками в результате владения и использования могут быть получены экономические выгоды.
definition: Land consists of the ground, including the soil covering and any associated surface waters, over which ownership rights are enforced and from which economic benefits can be derived by their owners by holding or using them.
in scheme: Глоссарий
preferred label: Land
related: Водные ресурсы
related: Институциональная единица
related: Ресурсы минеральных и энергетических полезных ископаемых
related: Операция
related: Некультивируемые биологические ресурсы
related: Производство
related: Другие сооружения
top concept of: Глоссарий

Капитальные трансферты
type: Concept
comment: Капитальные трансферты являются обычно значительными по величине и нерегулярными, но ни то, ни другое не является необходимым условием для того, чтобы трансферт рассматривался как капитальный, а не текущий. Если возникает сомнение относительно того, следует ли отражать трансферт как текущий или как капитальный, его следует отражать как текущий.
comment: Capital transfers are often large and irregular but neither of these are necessary conditions for a transfer to be considered a capital rather than a current transfer. If there is doubt about whether a transfer should be treated as current or capital, it should be treated as current.
source: Система национальных счетов 2008
  source: https://stat.semanticpro.org/xwiki/wiki/NationalAccounts/view/%D0%91%D0%B8%D0%B1%D0%BB%D0%B8%D0%BE%D1%82%D0%B5%D0%BA%D0%B0/%D0%A1%D0%B8%D1%81%D1%82%D0%B5%D0%BC%D0%B0%20%D0%BD%D0%B0%D1%86%D0%B8%D0%BE%D…
requires: Финансовое требование
requires: Материальные оборотные средства
requires: Трансферт
requires: Актив
term status: draft
broader: Трансферт
definition: Капитальные трансферты представляют собой безвозмездные трансферты, при которых либо сторона, осуществляющая трансферт, использует соответствующие ресурсы путем передачи актива (кроме наличных денежных средств и материальных оборотных средств) или погашения финансового требования (кроме дебиторской задолженности), либо сторона, получающая трансферт, обязана приобрести некоторый актив (кроме наличных денежных средств), либо имеют место оба условия.
definition: Capital transfers are unrequited transfers where either the party making the transfer realizes the funds involved by disposing of an asset (other than cash or inventories), relinquishing a financial claim (other than accounts receivable) or the party receiving the transfer is obliged to acquire an asset (other than cash) or both conditions are met.
in scheme: Глоссарий
preferred label: Capital Transfers
related: Трансферт
top concept of: Глоссарий

Номинальная холдинговая прибыль на нефинансовый актив
type: Concept
source: Система национальных счетов 2008
  source: https://stat.semanticpro.org/xwiki/wiki/NationalAccounts/view/%D0%91%D0%B8%D0%B1%D0%BB%D0%B8%D0%BE%D1%82%D0%B5%D0%BA%D0%B0/%D0%A1%D0%B8%D1%81%D1%82%D0%B5%D0%BC%D0%B0%20%D0%BD%D0%B0%D1%86%D0%B8%D0%BE%D…
requires: Цена
requires: Актив
term status: draft
definition: Номинальная холдинговая прибыль на нефинансовый актив — это стоимость экономической выгоды, поступающей собственнику такого актива в результате изменения его цены за некоторый период времени.
definition: The nominal holding gain on a non-financial asset is the value of the benefit accruing to the owner of that asset as a result of a change in its price over a period of time.
in scheme: Глоссарий
preferred label: Nominal Holding Gain on a Non-financial Asset
top concept of: Глоссарий

Чистый национальный располагаемый доход
type: Concept
source: Система национальных счетов 2008
  source: https://stat.semanticpro.org/xwiki/wiki/NationalAccounts/view/%D0%91%D0%B8%D0%B1%D0%BB%D0%B8%D0%BE%D1%82%D0%B5%D0%BA%D0%B0/%D0%A1%D0%B8%D1%81%D1%82%D0%B5%D0%BC%D0%B0%20%D0%BD%D0%B0%D1%86%D0%B8%D0%BE%D…
requires: Чистый национальный доход
requires: Текущий трансферт
term status: draft
alternative label: Net National Disposable Income (NNDI)
alternative label: ЧНДР
definition: Чистый национальный располагаемый доход (ЧНРД) определяется как чистый национальный доход (ЧНД), плюс текущие трансферты, подлежащие получению из-за границы, минус текущие трансферты, подлежащие выплате за границу.
definition: Net national disposable income (NNDI) is defined as net national income (NNI) plus current transfers receivable from abroad less current transfers payable abroad.
in scheme: Глоссарий
preferred label: Net National Disposable Income
top concept of: Глоссарий

Права на пенсионные пособия
type: Concept
comment: Единственной операцией, отражаемой в финансовом счете для прав на пенсионные пособия, является разница между чистыми отчислениями, подлежащими получению, и чистыми пенсионными пособиями, подлежащими выплате. Увеличение прав на пенсионные пособия, показываемое в финансовом счете, равно записи в счете использовании доходов об изменении прав на пенсионные пособия плюс передача прав на пенсионные пособия от другого пенсионного фонда.
comment: The only transaction for pension entitlements recorded in the financial account is the difference between net contributions receivable and benefits payable. The increase in pension entitlements shown in the financial account is equal to the entry in the use of income accounts for the change in pension entitlements plus any transfer of entitlements from a previous pension manager.
source: Система национальных счетов 2008
  source: https://stat.semanticpro.org/xwiki/wiki/NationalAccounts/view/%D0%91%D0%B8%D0%B1%D0%BB%D0%B8%D0%BE%D1%82%D0%B5%D0%BA%D0%B0/%D0%A1%D0%B8%D1%81%D1%82%D0%B5%D0%BC%D0%B0%20%D0%BD%D0%B0%D1%86%D0%B8%D0%BE%D…
requires: Финансовое требование
term status: draft
definition: Pension entitlements show the extent of financial claims both existing and future pensioners hold against either their employer or a fund designated by the employer to pay pensions earned as part of a compensation agreement between the employer and employee.
definition: Права на пенсионные пособия отражают объем финансовых требований как настоящих, так и будущих пенсионеров к их работодателю или к фонду, выбранному работодателем для выплаты заработанных пенсий в соответствии с условиями трудового договора между работодателем и работником.
in scheme: Глоссарий
preferred label: Pension Entitlements Show
related: Операция
top concept of: Глоссарий

Расходы на конечное потребление НКОДХ
type: Concept
comment: Расходы на конечное потребление НКОДХ могут быть классифицированы несколькими способами. В частности, они могут быть классифицированы: a. В соответствии с тем, были ли товары или услуги произведены рыночными или нерыночными производителями; b. В соответствии с тем, относятся ли расходы к коллективным услугам или к индивидуальным товарам и услугам; c. В соответствии с функцией или целью согласно Классификации целей <a target="_blank" rel="noopener noreferrer" href="https://stat.semanticpro.org/xwiki/wiki/NationalAccounts/view/%D0%93%D0%BB%D0%BE%D1%81%D1%81%D0%B0%D1%80%D0%B8%D0%B8/%D0%9D%D0%B5%D0%BA%D0%BE%D0%BC%D0%BC%D0%B5%D1%80%D1%87%D0%B5%D1%81%D0%BA%D0%B8%D0%B5%20%D0%BE%D1%80%D0%B3%D0%B0%D0%BD%D0%B8%D0%B7%D0%B0%D1%86%D0%B8%D0%B8%2C%20%D0%BE%D0%B1%D1%81%D0%BB%D1%83%D0%B6%D0%B8%D0%B2%D0%B0%D1%8E%D1%89%D0%B8%D0%B5%20%D0%B4%D0%BE%D0%BC%D0%B0%D1%88%D0%BD%D0%B8%D0%B5%20%D1%85%D0%BE%D0%B7%D1%8F%D0%B9%D1%81%D1%82%D0%B2%D0%B0/">некоммерческих организаций, обслуживающих домашние хозяйства (КЦНО); и d. В соответствии с типом товаров или услуг согласно КОП.
source: Система национальных счетов 2008
  source: https://stat.semanticpro.org/xwiki/wiki/NationalAccounts/view/%D0%91%D0%B8%D0%B1%D0%BB%D0%B8%D0%BE%D1%82%D0%B5%D0%BA%D0%B0/%D0%A1%D0%B8%D1%81%D1%82%D0%B5%D0%BC%D0%B0%20%D0%BD%D0%B0%D1%86%D0%B8%D0%BE%D…
requires: Некоммерческие организации, обслуживающие домашние хозяйства
requires: Товары
requires: Потребление
requires: Услуга коллективного потребления
requires: Услуги
term status: draft
broader: Расходы на конечное потребление
definition: Final consumption expenditure of NPISHs consists of the expenditure, including expenditure whose value must be estimated indirectly, incurred by resident NPISHs on individual consumption goods and services and possibly on collective consumption services.
definition: Расходы на конечное потребление НКОДХ состоят из расходов (включая расходы, стоимость которых должна быть оценена косвенным образом), понесенных <a target="_blank" rel="noopener noreferrer" href="https://stat.semanticpro.org/xwiki/wiki/NationalAccounts/view/%D0%93%D0%BB%D0%BE%D1%81%D1%81%D0%B0%D1%80%D0%B8%D0%B8/%D0%9D%D0%B5%D0%BA%D0%BE%D0%BC%D0%BC%D0%B5%D1%80%D1%87%D0%B5%D1%81%D0%BA%D0%B8%D0%B5%20%D0%BE%D1%80%D0%B3%D0%B0%D0%BD%D0%B8%D0%B7%D0%B0%D1%86%D0%B8%D0%B8%2C%20%D0%BE%D0%B1%D1%81%D0%BB%D1%83%D0%B6%D0%B8%D0%B2%D0%B0%D1%8E%D1%89%D0%B8%D0%B5%20%D0%B4%D0%BE%D0%BC%D0%B0%D1%88%D0%BD%D0%B8%D0%B5%20%D1%85%D0%BE%D0%B7%D1%8F%D0%B9%D1%81%D1%82%D0%B2%D0%B0/">НКОДХ — резидентами данной страны — на товары и услуги индивидуального потребления и, возможно, на услуги коллективного потребления.
in scheme: Глоссарий
preferred label: Final Consumption Expenditure of NPISHs
related: Некоммерческие организации, обслуживающие домашние хозяйства
related: Товары
related: Услуги
top concept of: Глоссарий

Прямые инвестиции
type: Concept
source: Система национальных счетов 2008
  source: https://stat.semanticpro.org/xwiki/wiki/NationalAccounts/view/%D0%91%D0%B8%D0%B1%D0%BB%D0%B8%D0%BE%D1%82%D0%B5%D0%BA%D0%B0/%D0%A1%D0%B8%D1%81%D1%82%D0%B5%D0%BC%D0%B0%20%D0%BD%D0%B0%D1%86%D0%B8%D0%BE%D…
requires: Предприятие
term status: draft
definition: Прямые инвестиции — это категория иностранных инвестиций, при которых резидент одной страны контролирует или имеет значительную степень влияния на управление предприятием, являющимся резидентом другой страны.
definition: Direct investment is a category of cross-border investment associated with a resident in one economy having control or a significant degree of influence on the management of an enterprise that is resident in another economy.
in scheme: Глоссарий
preferred label: Direct Investment
top concept of: Глоссарий

Бартер
type: Concept
comment: Стоимости товаров или услуг, приобретенных в бартерных операциях, представляют собой условно исчисленные расходы. Стоимости товаров или услуг, обмененных в бартерных операциях, должны быть определены косвенным образом путем приравнивания их к рыночным стоимостям. Таким образом, когда товары или услуги, полученные через бартер, используются для потребления домашних хозяйств, их условно оцененные стоимости должны быть отражены как расходы домашних хозяйств на конечное потребление. Когда товар, поставляемый по бартеру, является существующим товаром, а не впервые произведенным товаром, отрицательные условно исчисленные расходы должны быть отражены для единицы, поставляющей товар, таким же образом, как продажи существующих товаров отражаются как отрицательные расходы.
source: Система национальных счетов 2008
  source: https://stat.semanticpro.org/xwiki/wiki/NationalAccounts/view/%D0%91%D0%B8%D0%B1%D0%BB%D0%B8%D0%BE%D1%82%D0%B5%D0%BA%D0%B0/%D0%A1%D0%B8%D1%81%D1%82%D0%B5%D0%BC%D0%B0%20%D0%BD%D0%B0%D1%86%D0%B8%D0%BE%D…
requires: Товары
requires: Операция
requires: Услуги
term status: draft
alternative label: Бартерная операция
broader: Операция
definition: A barter transaction is one where one basket of goods and services is exchanged for another basket of different goods and services without any accompanying monetary payment.
definition: Бартерная операция — это такая операция, в которой один набор товаров и услуг обменивается на другой набор товаров и услуг без использования платежа в денежной форме.
in scheme: Глоссарий
preferred label: Barter
related: Товары
related: Домашнее хозяйство
related: Потребление
related: Услуги
top concept of: Глоссарий

Исторические памятники
type: Concept
comment: Они доступны для широкой публики, и с посетителей часто взимается плата за допуск к памятникам или на окружающую территорию. Их собственники, к которым могут относиться органы государственного управления, некоммерческие организации (НКО), корпорации или домашние хозяйства, обычно используют исторические памятники, чтобы предоставить культурные или развлекательные услуги. В принципе, валовое накопление основного капитала в форме исторических памятников следует относить к валовому накоплению жилых зданий, нежилых зданий и других сооружений в соответствии с их характером; на практике может оказаться целесообразным классифицировать их как другие сооружения. Потребление основного капитала в отношении новых памятников или существенных улучшений существующих памятников следует исчислять, исходя из предположения о достаточно больших сроках их использования.
source: Система национальных счетов 2008
  source: https://stat.semanticpro.org/xwiki/wiki/NationalAccounts/view/%D0%91%D0%B8%D0%B1%D0%BB%D0%B8%D0%BE%D1%82%D0%B5%D0%BA%D0%B0/%D0%A1%D0%B8%D1%81%D1%82%D0%B5%D0%BC%D0%B0%20%D0%BD%D0%B0%D1%86%D0%B8%D0%BE%D…
term status: draft
definition: Исторические памятники идентифицируются ввиду их особого исторического, национального, регионального, местного, религиозного или символического значения.
definition: Public monuments are identifiable because of particular historical, national, regional, local, religious or symbolic significance.
in scheme: Глоссарий
preferred label: Public Monuments
related: Валовое накопление основного капитала
related: Потребление основного капитала
related: Корпорация
related: Домашнее хозяйство
related: Валовое накопление
related: Жилые здания
related: Органы государственного управления
related: Услуги
related: Нежилые здания
related: Некоммерческие организации
related: Другие сооружения
top concept of: Глоссарий

Соглашение о будущей процентной ставке
type: Concept
comment: FRAs are settled by net cash payments. The only payment that takes place is related to the difference between the agreed forward rate agreement rate and the prevailing market rate at the time of settlement. The buyer of the forward rate agreement receives payment from the seller if the prevailing rate exceeds the agreed rate; the seller receives payment if the prevailing rate is lower than the agreed rate.
comment: Расчеты по СПС производятся чистыми наличными платежами. Единственный платеж, который производится, связан с разницей между ставкой, оговоренной в соглашении, и преобладающей рыночной ставкой на дату расчета. Покупатель соглашения о будущей процентной ставке получает платеж от продавца, если преобладающая рыночная ставка превышает согласованную ставку, а продавец получает платеж, если преобладающая рыночная ставка ниже, чем согласованная ставка.
source: Система национальных счетов 2008
  source: https://stat.semanticpro.org/xwiki/wiki/NationalAccounts/view/%D0%91%D0%B8%D0%B1%D0%BB%D0%B8%D0%BE%D1%82%D0%B5%D0%BA%D0%B0/%D0%A1%D0%B8%D1%81%D1%82%D0%B5%D0%BC%D0%B0%20%D0%BD%D0%B0%D1%86%D0%B8%D0%BE%D…
requires: Процент
term status: draft
alternative label: FRA
alternative label: СПС
definition: Соглашение о будущей процентной ставке (СПС) является контрактом, в соответствии с которым две стороны, чтобы защитить себя от колебаний процентных ставок, договариваются о процентной ставке, по которой на указанную дату расчета должны быть выплачены проценты на условную основную сумму, которая никогда не перечисляется.
definition: A forward rate agreement (FRA) is an arrangement in which two parties, in order to protect themselves against interest rate changes, agree on an interest rate to be paid, at a specified settlement date, on a notional amount of principal that is never exchanged.
in scheme: Глоссарий
preferred label: Forward Rate Agreement
top concept of: Глоссарий

Фактическое конечное потребление
type: Concept
comment: В счете использования скорректированного располагаемого дохода основной статьей на стороне ресурсов является скорректированный располагаемый доход, который является балансирующей статьей, перенесенной из счета перераспределения доходов в натуральной форме. На стороне использования основной статьей является фактическое конечное потребление.
source: Система национальных счетов 2008
  source: https://stat.semanticpro.org/xwiki/wiki/NationalAccounts/view/%D0%91%D0%B8%D0%B1%D0%BB%D0%B8%D0%BE%D1%82%D0%B5%D0%BA%D0%B0/%D0%A1%D0%B8%D1%81%D1%82%D0%B5%D0%BC%D0%B0%20%D0%BD%D0%B0%D1%86%D0%B8%D0%BE%D…
requires: Потребительские товары и услуги
term status: draft
definition: Actual final consumption measures the amount of consumption goods and services acquired.
definition: Фактическое конечное потребление представляет собой стоимость приобретенных потребительских товаров и услуг.
in scheme: Глоссарий
preferred label: Actual Final Consumption
related: Доход в натуральной форме
related: Скорректированный располагаемый доход
related: Балансирующая статья
top concept of: Глоссарий

Таблица ресурсов в ценах
type: Concept
comment: With a complete set of product balances, supply and use tables can be created. Supply and use tables exist in pairs with common valuation and level of detail as regards the products identified. The most common format of supply and use tables is at purchasers’ prices.
comment: Имея полный набор балансов продуктов, можно создать таблицы ресурсов и использования. Таблицы ресурсов и использования состоят из двух частей с общей стоимостной оценкой и степенью детализации в отношении идентифицированных продуктов. Наиболее стандартным является формат таблиц ресурсов и использования в ценах покупателей.
source: Система национальных счетов 2008
  source: https://stat.semanticpro.org/xwiki/wiki/NationalAccounts/view/%D0%91%D0%B8%D0%B1%D0%BB%D0%B8%D0%BE%D1%82%D0%B5%D0%BA%D0%B0/%D0%A1%D0%B8%D1%81%D1%82%D0%B5%D0%BC%D0%B0%20%D0%BD%D0%B0%D1%86%D0%B8%D0%BE%D…
requires: Продукты
requires: Цена покупателя
requires: Основная цена
requires: Производство
term status: draft
definition: A supply table at purchasers’ prices consists of a rectangular matrix with the rows corresponding to the same groups of products as the matching use tables and columns corresponding to the supply from domestic production valued at basic prices plus columns for imports and the valuation adjustments necessary to have total supply of each [group of] product[s] valued at purchasers’ prices
definition: Таблица ресурсов в ценах покупателей состоит из прямоугольной матрицы со строками, в которых отражаются те же группы продуктов, что и в соответствующей таблице использования, и колонками, в которых отражаются поступление ресурсов отечественного производства, оцененное в основных ценах, импорт и корректировки оценки, необходимые, чтобы получить общую величину ресурсов каждой группы продуктов, оцененную в ценах покупателей.
in scheme: Глоссарий
preferred label: Supply Table at Purchasers’ Prices
related: Баланс продукта
related: Цена покупателя
related: Продукты
top concept of: Глоссарий

Паритет покупательной способности
type: Concept
comment: Typically, a PPP for a country is expressed in terms of the currency of a base country, with the US dollar commonly being used. PPPs are thus weighted averages of the relative prices, quoted in national currency, of comparable items between countries. Used as deflators, they enable cross-country comparisons of GDP and its expenditure components.
comment: Как правило, ППС страны выражается в валюте базовой страны, при этом обычно используется доллар США. Таким образом, ППС представляют собой средневзвешенные соотношения цен сопоставимых между странами товаров и услуг в национальных валютах стран. Используемые в качестве дефляторов, они позволяют осуществлять международные сопоставления ВВП и его компонентов.
source: Система национальных счетов 2008
  source: https://stat.semanticpro.org/xwiki/wiki/NationalAccounts/view/%D0%91%D0%B8%D0%B1%D0%BB%D0%B8%D0%BE%D1%82%D0%B5%D0%BA%D0%B0/%D0%A1%D0%B8%D1%81%D1%82%D0%B5%D0%BC%D0%B0%20%D0%BD%D0%B0%D1%86%D0%B8%D0%BE%D…
requires: Товары
requires: Услуги
term status: draft
alternative label: ППС
alternative label: PPP
definition: A purchasing power parity (PPP) is defined as the number of units of B’s currency that are needed in B to purchase the same quantity of individual good or service as one unit of A’s currency will purchase in A.
definition: Паритет покупательной способности (ППС) определяется как число единиц валюты страны B, необходимое в стране B, чтобы приобрести такое же количество товаров и услуг, которое можно приобрести за одну единицу валюты страны A в стране A.
in scheme: Глоссарий
preferred label: Purchasing Power Parity
related: Цена
related: Товары
related: Валовый внутренний продукт
related: Услуги
top concept of: Глоссарий

Распределенный доход
type: Concept
comment: Исходя из этого, можно рассмотреть соотношение между дивидендами и распределенным доходом за недавнее прошлое и оценить правдоподобность того, насколько уровень объявленных дивидендов соответствует прошлой практике, допуская некоторую степень выравнивания по годам. Если уровень объявленных дивидендов существенно выше этого соотношения, превышение должно рассматриваться как финансовая операция, а именно, как изъятие из собственного капитала корпорации.
comment: From this it is possible to look at the ratio of dividends to distributable income over the recent past and assess the plausibility that the current level of dividends declared is in line with past practice, accepting some degree of smoothing from year to year. If the level of dividends declared is greatly in excess of this, the excess should be treated as a financial transaction, specifically the withdrawal of owners’ equity from the corporation.
source: Система национальных счетов 2008
  source: https://stat.semanticpro.org/xwiki/wiki/NationalAccounts/view/%D0%91%D0%B8%D0%B1%D0%BB%D0%B8%D0%BE%D1%82%D0%B5%D0%BA%D0%B0/%D0%A1%D0%B8%D1%81%D1%82%D0%B5%D0%BC%D0%B0%20%D0%BD%D0%B0%D1%86%D0%B8%D0%BE%D…
requires: Корпорация
requires: Текущий трансферт
term status: draft
definition: Distributable income of a corporation is equal to entrepreneurial income, plus all current transfers receivable, less all current transfers payable and less the adjustment for the change in pension entitlements relating to the pension scheme of that corporation.
definition: Распределенный доход корпорации равен предпринимательскому доходу плюс все текущие трансферты, подлежащие получению, минус все текущие трансферты, подлежащие выплате, минус корректировка на изменение в пенсионных правах в пенсионной программе этой корпорации.
in scheme: Глоссарий
preferred label: Distributable Income
related: Дивиденды
related: Корпорация
related: Операция
top concept of: Глоссарий

ВВП, исчисленный производственным методом
type: Concept
comment: Оценка ВВП производственным методом может быть также представлена как добавленная стоимость, скорректированная таким образом, чтобы обеспечить включение всех налогов на продукты за вычетом субсидий на продукты.
comment: The production measure of GDP can also be expressed as value added adjusted to ensure all taxes less subsidies on products are included.
source: Система национальных счетов 2008
  source: https://stat.semanticpro.org/xwiki/wiki/NationalAccounts/view/%D0%91%D0%B8%D0%B1%D0%BB%D0%B8%D0%BE%D1%82%D0%B5%D0%BA%D0%B0/%D0%A1%D0%B8%D1%81%D1%82%D0%B5%D0%BC%D0%B0%20%D0%BD%D0%B0%D1%86%D0%B8%D0%BE%D…
requires: Промежуточное потребление
requires: Субсидия на продукт
requires: Выпуск
requires: Налог на продукт
term status: draft
alternative label: Валовой внутренний продукт производственным методом
broader: Валовый внутренний продукт
definition: Оценка валового внутреннего продукта (ВВП) производственным методом получается как стоимость выпуска, минус промежуточное потребление, плюс любые налоги на продукты за вычетом субсидий на продукты, кроме тех, которые уже включены в стоимость выпуска.
definition: The production measure of gross domestic product (GDP) is derived as the value of output less intermediate consumption plus any taxes less subsidies on products not already included in the value of output.
in scheme: Глоссарий
preferred label: Production Measure of Gross Domestic Product
related: Субсидия на продукт
related: Налог на продукт
top concept of: Глоссарий

Чистая стоимость капитала
type: Concept
source: Система национальных счетов 2008
  source: https://stat.semanticpro.org/xwiki/wiki/NationalAccounts/view/%D0%91%D0%B8%D0%B1%D0%BB%D0%B8%D0%BE%D1%82%D0%B5%D0%BA%D0%B0/%D0%A1%D0%B8%D1%81%D1%82%D0%B5%D0%BC%D0%B0%20%D0%BD%D0%B0%D1%86%D0%B8%D0%BE%D…
requires: Институциональный сектор
requires: Институциональная единица
requires: Обязательство
requires: Актив
term status: draft
definition: Net worth is defined as the value of all the assets owned by an institutional unit or sector less the value of all its outstanding liabilities.
definition: Чистая стоимость капитала определяется как стоимость всех активов, принадлежащих институциональной единице или институциональному сектору, за вычетом стоимости всех ее или его обязательств.
in scheme: Глоссарий
preferred label: Net Worth
top concept of: Глоссарий

Границы сферы производства в СНС
type: Concept
comment: Границы сферы производства в СНС имеют более ограниченный характер по сравнению с общим определением границ производства. Виды деятельности, осуществляемые домашними хозяйствами, которые производят услуги для их собственного использования, не включаются в концепцию производства СНС, за исключением жилищных услуг, предоставляемых самим себе собственниками жилищ, в которых они живут, и домашних услуг, произведенных оплачиваемой наемной прислугой. В остальном определение границ сферы производства в СНС совпадает с общим определением сферы производств.
source: Система национальных счетов 2008
  source: https://stat.semanticpro.org/xwiki/wiki/NationalAccounts/view/%D0%91%D0%B8%D0%B1%D0%BB%D0%B8%D0%BE%D1%82%D0%B5%D0%BA%D0%B0/%D0%A1%D0%B8%D1%81%D1%82%D0%B5%D0%BC%D0%B0%20%D0%BD%D0%B0%D1%86%D0%B8%D0%BE%D…
requires: Продукты
requires: Товары
requires: Домашнее хозяйство
requires: Потребление
requires: Валовое накопление
requires: Производство
requires: Услуги
term status: draft
definition: The production boundary of the SNA includes the following activities: (a) The production of all goods or services that are supplied to units other than their producers, or intended to be so supplied, including the production of goods or services used up in the process of producing such goods or services. (b) The own-account production of all goods that are retained by their producers for their own final consumption or gross capital formation. (c) The own-account production of knowledge-capturing products that are retained by their producers for their own final consumption or gross capital formation but excluding (by convention) such products produced by households for their own use. (d) The own-account production of housing services by owner occupiers. (e) The production of domestic and personal services by employing paid domestic staff.
definition: Границы сферы производства в СНС включают следующие виды деятельности: a) производство всех товаров или услуг, которые предоставляются производителями другим единицам или которые имеется ввиду предоставить, включая производство товаров и услуг, использованных в процессе производства таких товаров или услуг; b) производство всех товаров, которые используются их производителями для собственного конечного потребления или валового накопления; c) производство продуктов, содержащих запас знаний, которые используются их производителями для собственного конечного потребления или валового накопления, но исключая (по договоренности) такие продукты, произведенные домашними хозяйствами для собственного использования; d) производство жилищных услуг собственниками жилищ, в которых они живут, для собственного потребления; e) производство домашних и личных услуг наемной оплачиваемой прислугой
in scheme: Глоссарий
preferred label: Production Boundary of the SNA
related: Домашнее хозяйство
related: Услуги
related: Производство
top concept of: Глоссарий

Незавершенное производство
type: Concept
source: Система национальных счетов 2008
  source: https://stat.semanticpro.org/xwiki/wiki/NationalAccounts/view/%D0%91%D0%B8%D0%B1%D0%BB%D0%B8%D0%BE%D1%82%D0%B5%D0%BA%D0%B0/%D0%A1%D0%B8%D1%81%D1%82%D0%B5%D0%BC%D0%B0%20%D0%BD%D0%B0%D1%86%D0%B8%D0%BE%D…
requires: Предприятие
requires: Продукты
requires: Институциональная единица
requires: Выпуск
term status: draft
definition: Незавершенное производство состоит из выпуска продукции, произведенного предприятием, который еще недостаточно обработан, чтобы быть в том состоянии, в котором он обычно поставляется другим институциональным единицам.
definition: Work-in-progress consists of output produced by an enterprise that is not yet sufficiently processed to be in a state in which it is normally supplied to other institutional units.
in scheme: Глоссарий
preferred label: Work-in-Progress
top concept of: Глоссарий

Другие машины и оборудование
type: Concept
comment: Примерами являются продукты, кроме запасных частей и предметов, идентифицированных в других категориях накопления основного капитала, включенные в CPC-2.0: машины общего назначения машины специального назначения офисное, бухгалтерское и счетное оборудование электрические машины и аппараты аппараты и оборудование для радио, телевидения и коммуникаций медицинские устройства, точные и оптические инструменты, часы. Другими примерами являются продукты, кроме запасных частей, включенные в CPC-2.0 в группы: топливные элементы (катриджи) для ядерных реакторов мебель музыкальные инструменты спортивные товары паровые генераторы, кроме котлов центрального отопления.
source: Система национальных счетов 2008
  source: https://stat.semanticpro.org/xwiki/wiki/NationalAccounts/view/%D0%91%D0%B8%D0%B1%D0%BB%D0%B8%D0%BE%D1%82%D0%B5%D0%BA%D0%B0/%D0%A1%D0%B8%D1%81%D1%82%D0%B5%D0%BC%D0%B0%20%D0%BD%D0%B0%D1%86%D0%B8%D0%BE%D…
requires: Машины и оборудование
term status: draft
broader: Машины и оборудование
definition: Other machinery and equipment consists of machinery and equipment not elsewhere classified.
definition: Другие машины и оборудование включают машины и оборудование, не классифицированные в других категориях.
in scheme: Глоссарий
preferred label: Other Machinery and Equipment
related: Продукты
top concept of: Глоссарий

Подсектор пенсионных фондов
type: Concept
comment: Pension liabilities arise when an employer or government obliges or encourages members of households to participate in a social insurance scheme that will provide income in retirement. The social insurance schemes may be organized by employers or by government, they may be organized by insurance corporations on behalf of employees or separate institutional units may be established to hold and manage the assets to be used to meet the pensions and to distribute the pensions.
comment: Пенсионные обязательства возникают тогда, когда работодатель или органы государственного управления обязывают или поощряют членов домашних хозяйств участвовать в программах социального страхования, которые обеспечат доход пенсионерам. Программы социального страхования могут быть организованы работодателями или органами государственного управления, страховыми корпорациями от имени работающих по найму, или отдельные институциональные единицы могут быть учреждены для того, чтобы быть держателями активов и управлять ими для обеспечения пенсионных прав и выплаты пенсий.
source: Система национальных счетов 2008
  source: https://stat.semanticpro.org/xwiki/wiki/NationalAccounts/view/%D0%91%D0%B8%D0%B1%D0%BB%D0%B8%D0%BE%D1%82%D0%B5%D0%BA%D0%B0/%D0%A1%D0%B8%D1%81%D1%82%D0%B5%D0%BC%D0%B0%20%D0%BD%D0%B0%D1%86%D0%B8%D0%BE%D…
requires: Институциональная единица
term status: draft
definition: The pension fund subsector consists of only those social insurance pension funds that are institutional units separate from the units that create them.
definition: Подсектор пенсионных фондов включает только те фонды пенсионного социального страхования, которые являются институциональными единицами, отдельными от единиц, которые их создают.
in scheme: Глоссарий
preferred label: Pension Fund Subsector
related: Институциональная единица
related: Программа социального страхования
related: Домашнее хозяйство
related: Обязательство
related: Органы государственного управления
related: Страховые корпорации
related: Актив
top concept of: Глоссарий

Неурегулированные требования по страховым возмещениям
type: Concept
source: Система национальных счетов 2008
  source: https://stat.semanticpro.org/xwiki/wiki/NationalAccounts/view/%D0%91%D0%B8%D0%B1%D0%BB%D0%B8%D0%BE%D1%82%D0%B5%D0%BA%D0%B0/%D0%A1%D0%B8%D1%81%D1%82%D0%B5%D0%BC%D0%B0%20%D0%BD%D0%B0%D1%86%D0%B8%D0%BE%D…
term status: draft
definition: Claims outstanding cover claims that have not been reported, have been reported but are not yet settled or have been both reported and settled but not yet paid.
definition: Неурегулированные требования по страховым возмещениям включают требования, которые не были заявлены, требования, которые были заявлены, но пока не урегулированы, или которые были заявлены и урегулированы, но не оплачены.
in scheme: Глоссарий
preferred label: Claims Outstanding
top concept of: Глоссарий

Рыночный выпуск
type: Concept
comment: The value of market output is determined as the sum of the following items: a. The value of goods and services sold at economically significant prices; b. The value of goods or services bartered in exchange for other goods, services or assets; c. The value of goods or services used for payments in kind, including compensation in kind; d. The value of goods or services supplied by one establishment to another belonging to the same market enterprise to be used as intermediate inputs where the risk associated with continuing the production process is transferred along with the goods; e. The value of changes in inventories of finished goods and work-in-progress intended for one or other of the above uses; f. The margins charged on the supply of goods and services, transport margins, margins on the acquisition and disposal of financial assets, etc.
comment: Стоимость рыночного выпуска определяется как сумма следующих статей: a. стоимость товаров и услуг, проданных по экономически значимым ценам; b. стоимость товаров и услуг, обмененных по бартеру на другие товары и услуги или активы; c. стоимость товаров и услуг, использованных в качестве платежей в натуральной форме, включая оплату труда в натуральной форме; d. стоимость товаров и услуг, поставленных одним заведением другому заведению, принадлежащему тому же рыночному предприятию, для использования в качестве промежуточного потребления, когда риск, связанный с продолжением производственного процесса, передается вместе с товарами; e. стоимость изменения запасов готовых, но не проданных товаров, и незавершенного производства, предназначенных для одного или другого упомянутого вида использования; f. торговая наценка на поставку товаров и услуг, транспортные расходы, наценка в операциях по приобретению и реализации финансовых активов и т. д.
source: Система национальных счетов 2008
  source: https://stat.semanticpro.org/xwiki/wiki/NationalAccounts/view/%D0%91%D0%B8%D0%B1%D0%BB%D0%B8%D0%BE%D1%82%D0%B5%D0%BA%D0%B0/%D0%A1%D0%B8%D1%81%D1%82%D0%B5%D0%BC%D0%B0%20%D0%BD%D0%B0%D1%86%D0%B8%D0%BE%D…
requires: Экономически значимые цены
requires: Выпуск
term status: draft
broader: Выпуск
definition: Рыночный выпуск включает выпуск, предназначенный для продажи по экономически значимым ценам.
definition: Market output consists of output intended for sale at economically significant prices.
in scheme: Глоссарий
preferred label: Market Output
related: Предприятие
related: Оплата труда
related: Торговая наценка
related: Запасы
related: Промежуточное потребление
related: Финансовые активы
related: Экономически значимые цены
related: Незавершенное производство
related: Бартер
related: Услуги
related: Заведение
related: Товары
related: Операция
related: Актив
top concept of: Глоссарий

Субсидии
type: Concept
comment: Получателями субсидий являются производители или импортеры-резиденты. В случае производителей-резидентов субсидии могут быть предназначены для воздействия на уровень производства, на цену, по которой продается их продукция, или на доходы институциональных единиц, участвующих в производстве. Субсидии эквивалентны отрицательным налогам на производство, поскольку их влияние на прибыль противоположно влиянию налогов на производство.
source: Система национальных счетов 2008
  source: https://stat.semanticpro.org/xwiki/wiki/NationalAccounts/view/%D0%91%D0%B8%D0%B1%D0%BB%D0%B8%D0%BE%D1%82%D0%B5%D0%BA%D0%B0/%D0%A1%D0%B8%D1%81%D1%82%D0%B5%D0%BC%D0%B0%20%D0%BD%D0%B0%D1%86%D0%B8%D0%BE%D…
requires: Предприятие
requires: Товары
requires: Услуги
requires: Производство
term status: draft
definition: Субсидии — это текущие безвозмездные выплаты, производимые единицами сектора государственного управления, в том числе нерезидентскими единицами сектора государственного управления, предприятиям, исходя из объема их производственной деятельности, количества или стоимости товаров и услуг, которые они производят, продают или импортируют.
definition: Subsidies are current unrequited payments that government units, including non-resident government units, make to enterprises on the basis of the levels of their production activities or the quantities or values of the goods or services that they produce, sell or import.
in scheme: Глоссарий
preferred label: Subsidies
related: Цена
related: Продукты
related: Налоги
related: Институциональная единица
related: Производство
top concept of: Глоссарий

Другие потоки
type: Concept
source: Система национальных счетов 2008
  source: https://stat.semanticpro.org/xwiki/wiki/NationalAccounts/view/%D0%91%D0%B8%D0%B1%D0%BB%D0%B8%D0%BE%D1%82%D0%B5%D0%BA%D0%B0/%D0%A1%D0%B8%D1%81%D1%82%D0%B5%D0%BC%D0%B0%20%D0%BD%D0%B0%D1%86%D0%B8%D0%BE%D…
requires: Операция
requires: Обязательство
requires: Актив
term status: draft
definition: Other flows are changes in the value of assets and liabilities that do not result from transactions.
definition: Другие потоки представляют собой изменения в стоимости активов и обязательств, которые не являются результатами операций.
in scheme: Глоссарий
preferred label: Other flows
top concept of: Глоссарий

Программа с определенной величиной отчислений
type: Concept
source: Система национальных счетов 2008
  source: https://stat.semanticpro.org/xwiki/wiki/NationalAccounts/view/%D0%91%D0%B8%D0%B1%D0%BB%D0%B8%D0%BE%D1%82%D0%B5%D0%BA%D0%B0/%D0%A1%D0%B8%D1%81%D1%82%D0%B5%D0%BC%D0%B0%20%D0%BD%D0%B0%D1%86%D0%B8%D0%BE%D…
requires: Социальные пособия
requires: Актив
term status: draft
definition: Программа с определенной величиной отчислений — это программа, в соответствии с которой социальные пособия, подлежащие выплате наемному работнику в связи с уходом на пенсию, определяются исходя из величины фонда, сформированного из отчислений, произведенных работником в течение срока его службы, и увеличения стоимости его активов в результате инвестирования этих активов управляющим программой.
definition: A defined contribution scheme is one where the benefits payable to an employee on retirement are defined exclusively in terms of the level of the fund built up from the contributions made over the employee’s working life and the increases in value that result from the investment of these funds by the manager of the scheme.
in scheme: Глоссарий
preferred label: Defined Contribution Scheme
top concept of: Глоссарий

Ценности
type: Concept
comment: Предполагается, что в течение длительного периода времени реальная стоимость ценностей увеличится или, по крайней мере, не уменьшится, и что ценности не утратят своих физических свойств при нормальных условиях. Ценности включают драгоценные металлы и камни, ювелирные изделия, произведения искусства и т. д. Ценностями могут обладать все секторы экономики.
source: Система национальных счетов 2008
  source: https://stat.semanticpro.org/xwiki/wiki/NationalAccounts/view/%D0%91%D0%B8%D0%B1%D0%BB%D0%B8%D0%BE%D1%82%D0%B5%D0%BA%D0%B0/%D0%A1%D0%B8%D1%81%D1%82%D0%B5%D0%BC%D0%B0%20%D0%BD%D0%B0%D1%86%D0%B8%D0%BE%D…
requires: Запасы
requires: Товары
requires: Потребление
requires: Производство
term status: draft
definition: Valuables are produced goods of considerable value that are not used primarily for purposes of production or consumption but are held as stores of value over time.
definition: Ценности — это произведенные товары значительной стоимости, которые не используются преимущественно в целях производства или потребления, но хранятся в течение некоторого периода времени в качестве запасов стоимости.
in scheme: Глоссарий
preferred label: Valuables
top concept of: Глоссарий

Ресурсы животных
type: Concept
comment: Они включают племенной скот, молочное стадо, рабочий скот, овец или других животных, используемых для производства шерсти, и животных, используемых для транспортировки, скачек или развлечений. Животные, выращиваемые на убой, включая домашнюю птицу, являются не основными фондами, но материальными оборотными средствами. Животные, не достигшие продуктивного возраста, не включаются в эту категорию, если только они не произведены для собственного использования.
comment: They include breeding stocks, dairy cattle, draft animals, sheep or other animals used for wool production and animals used for transportation, racing or entertainment. Animals raised for slaughter, including poultry, are not fixed assets but inventories. Immature cultivated assets are excluded unless produced for own use.
source: Система национальных счетов 2008
  source: https://stat.semanticpro.org/xwiki/wiki/NationalAccounts/view/%D0%91%D0%B8%D0%B1%D0%BB%D0%B8%D0%BE%D1%82%D0%B5%D0%BA%D0%B0/%D0%A1%D0%B8%D1%81%D1%82%D0%B5%D0%BC%D0%B0%20%D0%BD%D0%B0%D1%86%D0%B8%D0%BE%D…
requires: Продукты
requires: Институциональная единица
term status: draft
definition: Ресурсы животных, приносящих продукцию на регулярной основе, охватывают животных, естественный рост и воспроизводство которых находятся под непосредственным контролем, ответственностью и управлением институциональных единиц.
definition: Animal resources yielding repeat products cover animals whose natural growth and regeneration are under the direct control, responsibility and management of institutional units.
in scheme: Глоссарий
preferred label: Animal Resources
related: Материальные оборотные средства
related: Производство
top concept of: Глоссарий

Глоссарий
type: ConceptScheme
comment: При разработке глоссария использовались результаты анализа документов и материалов, внешних источников, словарей и энциклопедий по разделу, а также результаты гармонизации понятий.
version info: 42.1
definition: Глоссарий представляет собой словарь узкоспециализированных терминов раздела и формируется на основе анализа методологических документов, толковых словарей и энциклопедий в области статистики национальных счетов. Глоссарий реализован как совокупность концептов, имеющих толкование (лексическое отражение), с поддержкой мультиязычности, комментариев и примеров, а также семантических отношений между концептами.
has top concept: Налог на добавленную стоимость
has top concept: Реорганизация долга
has top concept: Разделенные ценные бумаги
has top concept: Местная единица
has top concept: Опцион на приобретение акций работниками
has top concept: Расходы на конечное потребление
has top concept: Субсидии на экспорт
has top concept: Приобретение товаров и услуг
has top concept: Незаработанная страховая премия
has top concept: Валовой национальный доход
has top concept: Текущие трансферты в рамках международного сотрудничества
has top concept: Долговые ценные бумаги
has top concept: Баланс продукта
has top concept: Улучшения земли
has top concept: Налоги на капитал
has top concept: Институциональная единица
has top concept: Социальные трансферты в натуральной форме
has top concept: Налоги на продукты, исключая НДС, налоги на импорт и экспорт
has top concept: Институциональный сектор
has top concept: Договор операционного лизинга
has top concept: Единица вида деятельности
has top concept: Запасы
has top concept: Промежуточное потребление
has top concept: Вспомогательные финансовые корпорации
has top concept: Основная цена
has top concept: Чистые отчисления на социальное страхование
has top concept: Налоги и пошлины на импорт
has top concept: Страховые возмещения (кроме выплат по страхованию жизни)
has top concept: Изъятие из дохода квазикорпорации
has top concept: Переводимые депозиты
has top concept: Нереализованная холдинговая прибыль
has top concept: Счет товаров и услуг
has top concept: Финансовое требование
has top concept: Цена производителя
has top concept: Потребление основного капитала
has top concept: Лица, работающие по найму (наемные работники)
has top concept: Потребление товаров и услуг
has top concept: Незавершенное производство культивируемых биологических ресурсов
has top concept: Разведка и оценка запасов полезных ископаемых
has top concept: Разрешение на занятие определенным видом деятельности
has top concept: Основные фонды
has top concept: Налог на продукт
has top concept: Некультивируемые биологические ресурсы
has top concept: Разрешения на использование природных ресурсов
has top concept: Предприятие
has top concept: Налоги на доходы
has top concept: Вертикально интегрированное предприятие
has top concept: Социальные пособия
has top concept: Юридическое лицо
has top concept: Другие капитальные трансферты
has top concept: Некоммерческие организации, обслуживающие домашние хозяйства
has top concept: Финансовые корпорации
has top concept: Торговые прибыли или убытки вследствие изменений в условиях внешней торговли
has top concept: Акционерный капитал
has top concept: Граница активов
has top concept: Портфельные инвестиции
has top concept: Горизонтально интегрированное предприятие
has top concept: Другие субсидии на производство
has top concept: Цена
has top concept: Оплата труда
has top concept: Форвардный контракт
has top concept: Вексель
has top concept: Корпорация
has top concept: Занятые лица
has top concept: Процент
has top concept: Гудвилл и маркетинговые активы
has top concept: Ссуды
has top concept: Реальный валовой внутренний доход
has top concept: Резервы для урегулирования требований
has top concept: Нераспределенный доход корпорации или квазикорпорации
has top concept: Валютно-обменный своп
has top concept: Фактическое конечное потребление сектора НКОДХ
has top concept: Налоги на производство, подлежащие выплате
has top concept: Фактическое конечное потребление сектора государственного управления
has top concept: Акции и паи фондов денежного рынка

Текущие налоги на доходы, имущество и т. д.
type: Concept
comment: Кроме того, в эту категорию не входят налоги на собственность или чистую стоимость капитала, взимаемые нерегулярно и через длительные промежутки времени, либо в исключительных обстоятельствах (например, пошлины на получение наследства), которые рассматриваются как капитальные трансферты.
source: Система национальных счетов 2008
  source: https://stat.semanticpro.org/xwiki/wiki/NationalAccounts/view/%D0%91%D0%B8%D0%B1%D0%BB%D0%B8%D0%BE%D1%82%D0%B5%D0%BA%D0%B0/%D0%A1%D0%B8%D1%81%D1%82%D0%B5%D0%BC%D0%B0%20%D0%BD%D0%B0%D1%86%D0%B8%D0%BE%D…
requires: Налоги
requires: Корпорация
requires: Налоги на доходы
requires: Домашнее хозяйство
term status: draft
definition: Текущие налоги на доходы, имущество и т.д. включают, главным образом, налоги на доходы домашних хозяйств или прибыль корпораций и налоги на имущество, которые подлежат регулярной уплате в течение каждого периода сбора налогов (в отличие от капитальных налогов, обложение которыми происходит нерегулярно).
definition: Current taxes on income, wealth, etc. consist mainly of taxes on the incomes of households or profits of corporations and of taxes on wealth that are payable regularly every tax period (as distinct from capital taxes levied infrequently).
in scheme: Глоссарий
preferred label: Current Taxes on Income, Wealth, etc.
related: Чистая стоимость капитала
related: Налоги
related: Капитальные трансферты
top concept of: Глоссарий

Текущие трансферты единицам сектора НКОДХ
type: Concept
comment: Трансферты единицам сектора НКОДХ предназначены для покрытия издержек нерыночного производства <a target="_blank" rel="noopener noreferrer" href="https://stat.semanticpro.org/xwiki/wiki/NationalAccounts/view/%D0%93%D0%BB%D0%BE%D1%81%D1%81%D0%B0%D1%80%D0%B8%D0%B8/%D0%9D%D0%B5%D0%BA%D0%BE%D0%BC%D0%BC%D0%B5%D1%80%D1%87%D0%B5%D1%81%D0%BA%D0%B8%D0%B5%20%D0%BE%D1%80%D0%B3%D0%B0%D0%BD%D0%B8%D0%B7%D0%B0%D1%86%D0%B8%D0%B8%2C%20%D0%BE%D0%B1%D1%81%D0%BB%D1%83%D0%B6%D0%B8%D0%B2%D0%B0%D1%8E%D1%89%D0%B8%D0%B5%20%D0%B4%D0%BE%D0%BC%D0%B0%D1%88%D0%BD%D0%B8%D0%B5%20%D1%85%D0%BE%D0%B7%D1%8F%D0%B9%D1%81%D1%82%D0%B2%D0%B0/">НКОДХ или для обеспечения средств, из которых могут производиться текущие трансферты домашним хозяйствам-резидентам или нерезидентам в форме пособий по социальной помощи.
source: Система национальных счетов 2008
  source: https://stat.semanticpro.org/xwiki/wiki/NationalAccounts/view/%D0%91%D0%B8%D0%B1%D0%BB%D0%B8%D0%BE%D1%82%D0%B5%D0%BA%D0%B0/%D0%A1%D0%B8%D1%81%D1%82%D0%B5%D0%BC%D0%B0%20%D0%BD%D0%B0%D1%86%D0%B8%D0%BE%D…
requires: Некоммерческие организации, обслуживающие домашние хозяйства
requires: Институциональная единица
requires: Текущий трансферт
term status: draft
broader: Текущий трансферт
definition: Текущие трансферты единицам сектора НКОДХ включают текущие трансферты, полученные <a target="_blank" rel="noopener noreferrer" href="https://stat.semanticpro.org/xwiki/wiki/NationalAccounts/view/%D0%93%D0%BB%D0%BE%D1%81%D1%81%D0%B0%D1%80%D0%B8%D0%B8/%D0%9D%D0%B5%D0%BA%D0%BE%D0%BC%D0%BC%D0%B5%D1%80%D1%87%D0%B5%D1%81%D0%BA%D0%B8%D0%B5%20%D0%BE%D1%80%D0%B3%D0%B0%D0%BD%D0%B8%D0%B7%D0%B0%D1%86%D0%B8%D0%B8%2C%20%D0%BE%D0%B1%D1%81%D0%BB%D1%83%D0%B6%D0%B8%D0%B2%D0%B0%D1%8E%D1%89%D0%B8%D0%B5%20%D0%B4%D0%BE%D0%BC%D0%B0%D1%88%D0%BD%D0%B8%D0%B5%20%D1%85%D0%BE%D0%B7%D1%8F%D0%B9%D1%81%D1%82%D0%B2%D0%B0/">НКОДХ от других институциональных единиц, являющихся как резидентами данной страны, так и нерезидентами, в форме членских взносов, добровольных взносов и пожертвований и др., независимо от того, производятся ли они на регулярной или единовременной основе.
definition: Current transfers to NPISHs consist of transfers received by NPISHs from other resident or non-resident institutional units in the form of membership dues, subscriptions, voluntary donations, etc. whether made on a regular or occasional basis.
in scheme: Глоссарий
preferred label: Current Transfers to NPISHs
related: Некоммерческие организации, обслуживающие домашние хозяйства
related: Текущий трансферт
related: Домашнее хозяйство
related: Производство
top concept of: Глоссарий

Другие пособия по социальному страхованию, связанному с занятостью
type: Concept
comment: Пособия делятся на пенсии и другие пособия.
source: Система национальных счетов 2008
  source: https://stat.semanticpro.org/xwiki/wiki/NationalAccounts/view/%D0%91%D0%B8%D0%B1%D0%BB%D0%B8%D0%BE%D1%82%D0%B5%D0%BA%D0%B0/%D0%A1%D0%B8%D1%81%D1%82%D0%B5%D0%BC%D0%B0%20%D0%BD%D0%B0%D1%86%D0%B8%D0%BE%D…
requires: Программа социального страхования
requires: Социальные пособия
term status: draft
definition: Other employment-related social insurance benefits are social benefits payable by social insurance schemes other than social security to contributors to the schemes, their dependants or survivors.
definition: Другие пособия по социальному страхованию, связанному с занятостью — это социальные пособия, подлежащие выплате по программам социального страхования, кроме программ социального обеспечения, участникам этих программ, их иждивенцам или наследникам.
in scheme: Глоссарий
preferred label: Other Employment-Related Social Insurance Benefits
top concept of: Глоссарий

Продукты интеллектуальной собственности
type: Concept
comment: Примерами продуктов интеллектуальной собственности являются результаты научных исследований и разработок, <a target="_blank" rel="noopener noreferrer" href="https://stat.semanticpro.org/xwiki/wiki/NationalAccounts/view/%D0%93%D0%BB%D0%BE%D1%81%D1%81%D0%B0%D1%80%D0%B8%D0%B8/%D0%A0%D0%B0%D0%B7%D0%B2%D0%B5%D0%B4%D0%BA%D0%B0%20%D0%B8%20%D0%BE%D1%86%D0%B5%D0%BD%D0%BA%D0%B0%20%D0%B7%D0%B0%D0%BF%D0%B0%D1%81%D0%BE%D0%B2%20%D0%BF%D0%BE%D0%BB%D0%B5%D0%B7%D0%BD%D1%8B%D1%85%20%D0%B8%D1%81%D0%BA%D0%BE%D0%BF%D0%B0%D0%B5%D0%BC%D1%8B%D1%85/">разведки и оценки запасов полезных ископаемых, компьютерное программное обеспечение и базы данных, <a target="_blank" rel="noopener noreferrer" href="https://stat.semanticpro.org/xwiki/wiki/NationalAccounts/view/%D0%93%D0%BB%D0%BE%D1%81%D1%81%D0%B0%D1%80%D0%B8%D0%B8/%D0%9E%D1%80%D0%B8%D0%B3%D0%B8%D0%BD%D0%B0%D0%BB%D1%8B%20%D1%80%D0%B0%D0%B7%D0%B2%D0%BB%D0%B5%D0%BA%D0%B0%D1%82%D0%B5%D0%BB%D1%8C%D0%BD%D1%8B%D1%85%2C%20%D0%BB%D0%B8%D1%82%D0%B5%D1%80%D0%B0%D1%82%D1%83%D1%80%D0%BD%D1%8B%D1%85%20%D0%B8%20%D1%85%D1%83%D0%B4%D0%BE%D0%B6%D0%B5%D1%81%D1%82%D0%B2%D0%B5%D0%BD%D0%BD%D1%8B%D1%85%20%D0%BF%D1%80%D0%BE%D0%B8%D0%B7%D0%B2%D0%B5%D0%B4%D0%B5%D0%BD%D0%B8%D0%B9/">оригиналы развлекательных, литературных и художественных произведений. Основное, что их характеризует — это то, что большая часть их стоимости возникает благодаря интеллектуальной деятельности.
comment: Examples of intellectual property products are the results of research and development, mineral exploration and evaluation, computer software and databases, and entertainment, literary or artistic originals. They are characterized by the fact that most of their value is attributable to intellectual endeavour. They can be described in general terms in the following way.
source: Система национальных счетов 2008
  source: https://stat.semanticpro.org/xwiki/wiki/NationalAccounts/view/%D0%91%D0%B8%D0%B1%D0%BB%D0%B8%D0%BE%D1%82%D0%B5%D0%BA%D0%B0/%D0%A1%D0%B8%D1%81%D1%82%D0%B5%D0%BC%D0%B0%20%D0%BD%D0%B0%D1%86%D0%B8%D0%BE%D…
requires: Производство
term status: draft
definition: Продукты интеллектуальной собственности являются результатом научных исследований, разработок, изучения или инноваций, создающих знания, которые разработчики могут реализовать на рынке или использовать для получения выгод в процессе производства, потому что использование знаний ограничивается с помощью юридической или другой защиты.
definition: Intellectual property products are the result of research, development, investigation or innovation leading to knowledge that the developers can market or use to their own benefit in production because use of the knowledge is restricted by means of legal or other protection.
in scheme: Глоссарий
preferred label: Intellectual Property Products
related: База данных
related: Оригиналы развлекательных, литературных и художественных произведений
related: Разведка и оценка запасов полезных ископаемых
related: Компьютерное программное обеспечение
related: Научные исследования и разработки
top concept of: Глоссарий

Чистое кредитование
type: Concept
comment: Она показывает стоимость ресурсов, которые могут быть предоставлены для кредитования или которые необходимо заимствовать. Даже если средства не предоставляются в явной форме на цели кредитования, а сохраняются в форме запаса денежной наличности или на банковском депозите, держатель обязательств, корреспондирующих с этими финансовыми активами, по сути дела произвел заимствование у единицы, являющейся держателем наличных денежных средств или банковского депозита.
source: Система национальных счетов 2008
  source: https://stat.semanticpro.org/xwiki/wiki/NationalAccounts/view/%D0%91%D0%B8%D0%B1%D0%BB%D0%B8%D0%BE%D1%82%D0%B5%D0%BA%D0%B0/%D0%A1%D0%B8%D1%81%D1%82%D0%B5%D0%BC%D0%B0%20%D0%BD%D0%B0%D1%86%D0%B8%D0%BE%D…
requires: Потребление основного капитала
requires: Актив
requires: Изменение чистой стоимости капитала вследствие сбережения и капитальных трансфертов
term status: draft
alternative label: Чистое заимствование
definition: Net lending is defined as the difference between changes in net worth due to saving and capital transfers and net acquisitions of non-financial assets (acquisitions less disposals of non-financial assets, less consumption of fixed capital). If the amount is negative it represents net borrowing.
definition: Чистое кредитование определяется как разница между <a target="_blank" rel="noopener noreferrer" href="https://stat.semanticpro.org/xwiki/wiki/NationalAccounts/view/%D0%93%D0%BB%D0%BE%D1%81%D1%81%D0%B0%D1%80%D0%B8%D0%B8/%D0%98%D0%B7%D0%BC%D0%B5%D0%BD%D0%B5%D0%BD%D0%B8%D0%B5%20%D1%87%D0%B8%D1%81%D1%82%D0%BE%D0%B9%20%D1%81%D1%82%D0%BE%D0%B8%D0%BC%D0%BE%D1%81%D1%82%D0%B8%20%D0%BA%D0%B0%D0%BF%D0%B8%D1%82%D0%B0%D0%BB%D0%B0%20%D0%B2%D1%81%D0%BB%D0%B5%D0%B4%D1%81%D1%82%D0%B2%D0%B8%D0%B5%20%D1%81%D0%B1%D0%B5%D1%80%D0%B5%D0%B6%D0%B5%D0%BD%D0%B8%D1%8F%20%D0%B8%20%D0%BA%D0%B0%D0%BF%D0%B8%D1%82%D0%B0%D0%BB%D1%8C%D0%BD%D1%8B%D1%85%20%D1%82%D1%80%D0%B0%D0%BD%D1%81%D1%84%D0%B5%D1%80%D1%82%D0%BE%D0%B2/">изменением чистой стоимости капитала вследствие сбережения и капитальных трансфертов и чистым приобретением нефинансовых активов (приобретение нефинансовых активов за вычетом выбытия, минус потребление основного капитала). Если эта величина отрицательна, она представляет собой чистое заимствование.
example: Финансы: Чистое кредитование/чистое заимствование представляет собой сводный показатель масштаба предоставления органами государственного управления финансовых ресурсов в распоряжение других секторов экономики или других стран либо использования ими финансовых ресурсов, генерируемых другими секторами экономики или другими странами.
in scheme: Глоссарий
preferred label: Net Lending
related: Запасы
related: Финансовые активы
related: Обязательство
top concept of: Глоссарий

Реальная холдинговая прибыль (убыток)
type: Concept
source: Система национальных счетов 2008
  source: https://stat.semanticpro.org/xwiki/wiki/NationalAccounts/view/%D0%91%D0%B8%D0%B1%D0%BB%D0%B8%D0%BE%D1%82%D0%B5%D0%BA%D0%B0/%D0%A1%D0%B8%D1%81%D1%82%D0%B5%D0%BC%D0%B0%20%D0%BD%D0%B0%D1%86%D0%B8%D0%BE%D…
requires: Операция
requires: Актив
term status: draft
alternative label: Реальная холдинговая прибыль
alternative label: Реальный холдинговый убыток
definition: A real holding gain (loss) is the amount by which the value of an asset increases (decreases) over the neutral holding gain for the period, in the absence of transactions and other changes in the volume of assets.
definition: Реальная холдинговая прибыль (убыток) является величиной, на которую увеличивается (уменьшается) стоимость актива по сравнению с нейтральной холдинговой прибылью за период времени в отсутствие операций и других изменений в объеме активов.
in scheme: Глоссарий
preferred label: Real Holding Gain (Loss)
top concept of: Глоссарий

Органы государственного управления
type: Concept
comment: Основные функции органов государственного управления как институциональных единиц состоят в том, чтобы принимать ответственность за предоставление товаров и услуг обществу в целом или отдельным домашним хозяйствам и финансировать предоставление этих товаров и услуг за счет налоговых поступлений или других доходов; перераспределять доход и богатство с помощью трансфертов; и осуществлять нерыночное производство.
requires: Институциональная единица
term status: draft
alternative label: Государственная единица
broader: Институциональная единица
definition: Government units are unique kinds of legal entities established by political processes that have legislative, judicial or executive authority over other institutional units within a given area.
definition: Органы государственного управления (государственные единицы) представляют собой уникальные типы юридических лиц, учрежденные в результате политических процессов, которые обладают законодательной, судебной или исполнительной властью в отношении других институциональных единиц в пределах данной территории.
in scheme: Глоссарий
preferred label: Government units
related: Товары
related: Трансферт
related: Институциональная единица
related: Домашнее хозяйство
related: Производство
related: Услуги
top concept of: Глоссарий

Другие текущие трансферты
type: Concept
comment: Эта группа включает чистые премии и возмещения по программам страхования (кроме страхования жизни), текущие трансферты между различными типами единиц сектора государственного управления, обычно принадлежащих различным уровням государственного управления, а также между сектором государственного управления и иностранными правительствами; включаются также текущие трансферты единицам сектора <a target="_blank" rel="noopener noreferrer" href="https://stat.semanticpro.org/xwiki/wiki/NationalAccounts/view/%D0%93%D0%BB%D0%BE%D1%81%D1%81%D0%B0%D1%80%D0%B8%D0%B8/%D0%9D%D0%B5%D0%BA%D0%BE%D0%BC%D0%BC%D0%B5%D1%80%D1%87%D0%B5%D1%81%D0%BA%D0%B8%D0%B5%20%D0%BE%D1%80%D0%B3%D0%B0%D0%BD%D0%B8%D0%B7%D0%B0%D1%86%D0%B8%D0%B8%2C%20%D0%BE%D0%B1%D1%81%D0%BB%D1%83%D0%B6%D0%B8%D0%B2%D0%B0%D1%8E%D1%89%D0%B8%D0%B5%20%D0%B4%D0%BE%D0%BC%D0%B0%D1%88%D0%BD%D0%B8%D0%B5%20%D1%85%D0%BE%D0%B7%D1%8F%D0%B9%D1%81%D1%82%D0%B2%D0%B0/">НКОДХ и от них и между домашними хозяйствами-резидентами и нерезидентами.
comment: The group includes net premiums and claims under non-life insurance policies, current transfers between different kinds of government units, usually at different levels of government, and also between general government and foreign governments, as well as current transfers to and from NPISHs and between resident and non-resident households.
source: Система национальных счетов 2008
  source: https://stat.semanticpro.org/xwiki/wiki/NationalAccounts/view/%D0%91%D0%B8%D0%B1%D0%BB%D0%B8%D0%BE%D1%82%D0%B5%D0%BA%D0%B0/%D0%A1%D0%B8%D1%81%D1%82%D0%B5%D0%BC%D0%B0%20%D0%BD%D0%B0%D1%86%D0%B8%D0%BE%D…
requires: Отчисления на социальное страхование
requires: Налоги
requires: Институциональная единица
requires: Текущий трансферт
requires: Социальные пособия
term status: draft
definition: Другие текущие трансферты включают все текущие трансферты между институциональными единицами-резидентами или между резидентами и нерезидентами, кроме текущих налогов на доходы, имущество и т. д., отчислений на социальное страхование и социальных пособий, социальных пособий в натуральной форме.
definition: Other current transfers consist of all current transfers between resident institutional units, or between resident and non-resident units, other than current taxes on income, wealth, etc., social contributions and benefits, and social benefits in kind.
in scheme: Глоссарий
preferred label: Other Current Transfers
related: Некоммерческие организации, обслуживающие домашние хозяйства
related: Текущий трансферт
related: Домашнее хозяйство
related: Страхование жизни
top concept of: Глоссарий

Номинальная холдинговая прибыль на обязательство
type: Concept
source: Система национальных счетов 2008
  source: https://stat.semanticpro.org/xwiki/wiki/NationalAccounts/view/%D0%91%D0%B8%D0%B1%D0%BB%D0%B8%D0%BE%D1%82%D0%B5%D0%BA%D0%B0/%D0%A1%D0%B8%D1%81%D1%82%D0%B5%D0%BC%D0%B0%20%D0%BD%D0%B0%D1%86%D0%B8%D0%BE%D…
requires: Операция
requires: Обязательство
term status: draft
definition: The nominal holding gain on a liability is the decrease in value of the liability, other than by transactions or by other volume changes.
definition: Номинальная холдинговая прибыль на обязательство — это снижение стоимости обязательства, которое не является результатом операций или других изменений в объеме.
in scheme: Глоссарий
preferred label: Nominal Holding Gain On A Liability
top concept of: Глоссарий

Налоги на импорт, исключая НДС и пошлины
type: Concept
comment: They include the following: a. General sales taxes; b. Excise duties; c. Taxes on specific services; d. Profits of import monopolies; e. Taxes resulting from multiple exchange rates.
comment: В их число входят: a. Общие налоги на продажи; b. Акцизы; c. Налоги на отдельные виды услуг; d. Прибыли импортирующих монополий; e. Налоги, возникающие в результате существования множественных валютных курсов.
source: Система национальных счетов 2008
  source: https://stat.semanticpro.org/xwiki/wiki/NationalAccounts/view/%D0%91%D0%B8%D0%B1%D0%BB%D0%B8%D0%BE%D1%82%D0%B5%D0%BA%D0%B0/%D0%A1%D0%B8%D1%81%D1%82%D0%B5%D0%BC%D0%B0%20%D0%BD%D0%B0%D1%86%D0%B8%D0%BE%D…
requires: Налог на добавленную стоимость
requires: Импортные пошлины
requires: Товары
requires: Налоги
requires: Услуги
term status: draft
broader: Налоги
definition: Taxes on imports, excluding VAT and duties consist of all taxes (except VAT and import duties) as defined in the GFSM/OECD classifications that become payable when goods enter the economic territory or services are delivered by non- residents to residents.
definition: Налоги на импорт, исключая НДС и пошлины, включают все налоги (исключая НДС и импортные пошлины) в соответствии с классификациями РСГФ/ОЭСР, которые подлежат уплате при ввозе товаров на экономическую территорию страны или при оказании услуг нерезидентами резидентам.
in scheme: Глоссарий
preferred label: Taxes on Imports, Excluding VAT and Duties
top concept of: Глоссарий

Общественная организация
type: Concept
source: Система национальных счетов 2008
  source: https://stat.semanticpro.org/xwiki/wiki/NationalAccounts/view/%D0%91%D0%B8%D0%B1%D0%BB%D0%B8%D0%BE%D1%82%D0%B5%D0%BA%D0%B0/%D0%A1%D0%B8%D1%81%D1%82%D0%B5%D0%BC%D0%B0%20%D0%BD%D0%B0%D1%86%D0%B8%D0%BE%D…
term status: draft
alternative label: Юридическое лицо
definition: A legal or social entity is one whose existence is recognized by law or society independently of the persons, or other entities, that may own or control it.
definition: Юридическое лицо или общественная организация — это такая единица, существование которой признано законом или обществом, независимо от физических лиц или других юридических единиц, которые, возможно, являются их собственниками или контролируют их.
in scheme: Глоссарий
preferred label: Social Entity
top concept of: Глоссарий

Население
type: Concept
source: Система национальных счетов 2008
  source: https://stat.semanticpro.org/xwiki/wiki/NationalAccounts/view/%D0%91%D0%B8%D0%B1%D0%BB%D0%B8%D0%BE%D1%82%D0%B5%D0%BA%D0%B0/%D0%A1%D0%B8%D1%81%D1%82%D0%B5%D0%BC%D0%B0%20%D0%BD%D0%B0%D1%86%D0%B8%D0%BE%D…
term status: draft
definition: Население страны определяется как все лица, которые обычно являются резидентами страны.
definition: The population of a country is most simply defined as all those persons who are usually resident in the country.
in scheme: Глоссарий
preferred label: Population
top concept of: Глоссарий

Машины и оборудование
type: Concept
comment: Машины и оборудование, полученные по финансовому лизингу, отражаются в счетах как приобретенные пользователем (арендополучателем), а не как приобретенные арендодателем. Инструменты, которые относительно недороги, и затраты на которые имеют стабильный характер, такие как ручные инструменты, могут не включаться в данную категорию. Также не включаются машины и оборудование, являющиеся неотъемлемыми частями зданий, которые отнесены к категориям жилых зданий и нежилых зданий. В данную категорию включаются машины и оборудование за исключением систем вооружения, приобретенных в военных целях; системы вооружения включены в другую категорию. Машины и оборудование, такие как транспортные средства, мебель, кухонное оборудование, компьютеры, средства связи и т. д., которые были приобретены домашними хозяйствами в целях конечного потребления, не являются основными фондами, а их приобретение не рассматривается, как валовое накопление основного капитала.
source: Система национальных счетов 2008
  source: https://stat.semanticpro.org/xwiki/wiki/NationalAccounts/view/%D0%91%D0%B8%D0%B1%D0%BB%D0%B8%D0%BE%D1%82%D0%B5%D0%BA%D0%B0/%D0%A1%D0%B8%D1%81%D1%82%D0%B5%D0%BC%D0%B0%20%D0%BD%D0%B0%D1%86%D0%B8%D0%BE%D…
requires: Транспортное оборудование
requires: Другие машины и оборудование
requires: Информационное, компьютерное и телекоммуникационное оборудование
term status: draft
definition: Machinery and equipment covers transport equipment, machinery for information, communication and telecommunications (ICT) equipment, and other machinery and equipment.
definition: Машины и оборудование включают транспортное оборудование, <a target="_blank" rel="noopener noreferrer" href="https://stat.semanticpro.org/xwiki/wiki/NationalAccounts/view/%D0%93%D0%BB%D0%BE%D1%81%D1%81%D0%B0%D1%80%D0%B8%D0%B8/%D0%98%D0%BD%D1%84%D0%BE%D1%80%D0%BC%D0%B0%D1%86%D0%B8%D0%BE%D0%BD%D0%BD%D0%BE%D0%B5%2C%20%D0%BA%D0%BE%D0%BC%D0%BF%D1%8C%D1%8E%D1%82%D0%B5%D1%80%D0%BD%D0%BE%D0%B5%20%D0%B8%20%D1%82%D0%B5%D0%BB%D0%B5%D0%BA%D0%BE%D0%BC%D0%BC%D1%83%D0%BD%D0%B8%D0%BA%D0%B0%D1%86%D0%B8%D0%BE%D0%BD%D0%BD%D0%BE%D0%B5%20%D0%BE%D0%B1%D0%BE%D1%80%D1%83%D0%B4%D0%BE%D0%B2%D0%B0%D0%BD%D0%B8%D0%B5/">информационное, компьютерное и телекоммуникационное (ИКТ) оборудование и другие машины и оборудование.
in scheme: Глоссарий
preferred label: Machinery and Equipment
related: Системы вооружения
related: Валовое накопление основного капитала
related: Домашнее хозяйство
related: Потребление
related: Жилые здания
related: Нежилые здания
top concept of: Глоссарий

Издержки, связанные с передачей прав собственности
type: Concept
comment: Все эти издержки, связанные с передачей прав собственности, отражаются в счетах как валовое накопление основного капитала. Они относятся к покупателю или продавцу актива в зависимости от того, какая единица несет издержки. Издержки списываются на потребление основного капитала в течение периода, на протяжении которого новый собственник предполагает быть держателем актива, как обсуждалось в разделе о потреблении основного капитала, за исключением заключительных расходов, которые должны быть списаны в течение всего срока службы актива.
source: Система национальных счетов 2008
  source: https://stat.semanticpro.org/xwiki/wiki/NationalAccounts/view/%D0%91%D0%B8%D0%B1%D0%BB%D0%B8%D0%BE%D1%82%D0%B5%D0%BA%D0%B0/%D0%A1%D0%B8%D1%81%D1%82%D0%B5%D0%BC%D0%B0%20%D0%BD%D0%B0%D1%86%D0%B8%D0%BE%D…
requires: Цена
requires: Налоги
requires: Актив
requires: Услуги
term status: draft
definition: Издержки, связанные с передачей прав собственности, состоят из следующих статей: вся оплата профессиональных услуг или комиссионные, расходы по которым несут как единицы, приобретающие активы, так и единицы, реализующие активы; к ним относятся гонорары юристам, архитекторам, землемерам, инженерам и оценщикам, а также комиссионные вознаграждения агентам по недвижимости и аукционистам любые торговые и транспортные расходы, отдельно указанные в счете-фактуре, представленном покупателю все налоги, подлежащие выплате единицей, приобретающей актив, в связи с передачей права собственности на актив любой налог, подлежащий выплате в связи с выбытием актива любые издержки, связанные с доставкой, установкой или демонтажом, не включенные в цену приобретаемого или выбывающего актива любые заключительные расходы, понесенные в конце срока существования актива, например, требующиеся для обеспечения безопасности сооружения или для восстановления окружающей среды, где был расположен актив.
definition: The costs of ownership transfer consist of the following kinds of items: (a) All professional charges or commissions incurred by both units acquiring or disposing of an asset such as fees paid to lawyers, architects, surveyors, engineers and valuers, and commissions paid to estate agents and auctioneers. (b) Any trade and transport costs separately invoiced to the purchaser. (c) All taxes payable by the unit acquiring the asset on the transfer of ownership of the asset. (d) Any tax payable on the disposal of an asset. (e) Any delivery and installation or disinstallation costs not included in the price of the asset being acquired or disposed of. (f) Any terminal costs incurred at the end of an asset’s life such as those required to render the structure safe or to restore the environment in which it is situated.
in scheme: Глоссарий
preferred label: Costs of Ownership Transfer
related: Валовое накопление основного капитала
related: Потребление основного капитала
related: Актив
top concept of: Глоссарий

Налоги на экспорт
type: Concept
comment: Они включают: a. Экспортные пошлины; b. Прибыли экспортных монополий; c. Налоги, возникающие в результате существования множественных валютных курсов.
source: Система национальных счетов 2008
  source: https://stat.semanticpro.org/xwiki/wiki/NationalAccounts/view/%D0%91%D0%B8%D0%B1%D0%BB%D0%B8%D0%BE%D1%82%D0%B5%D0%BA%D0%B0/%D0%A1%D0%B8%D1%81%D1%82%D0%B5%D0%BC%D0%B0%20%D0%BD%D0%B0%D1%86%D0%B8%D0%BE%D…
requires: Товары
requires: Налоги
requires: Органы государственного управления
requires: Услуги
term status: draft
broader: Налоги
definition: Налоги на экспорт включают налоги на товары или услуги, которые подлежат уплате органам государственного управления, когда товары покидают экономическую территорию данной страны или когда услуги предоставлены нерезидентам.
definition: Export taxes consist of taxes on goods or services that become payable to government when the goods leave the economic territory or when the services are delivered to non-residents.
in scheme: Глоссарий
preferred label: Export Taxes
top concept of: Глоссарий

Вспомогательная деятельность
type: Concept
comment: Вспомогательной деятельности свойственны некоторые общие черты, производимой ими продукции. Эти дополнительные характеристики следующие: a. Выпуск вспомогательной деятельности не предназначен для использования вне предприятия; b. В результате вспомогательной деятельности, как правило, производится выпуск, обычно используемый в качестве затрат практически в любом виде производственной деятельности; c. Вспомогательная деятельность производит услуги (и, как исключение, товары, которые не становятся физически частью выпуска основной или вторичной деятельности); d. Стоимость выпуска вспомогательной деятельности, как правило, невелика по сравнению со стоимостью выпуска основной или вторичной деятельности предприятия.
source: Система национальных счетов 2008
  source: https://stat.semanticpro.org/xwiki/wiki/NationalAccounts/view/%D0%91%D0%B8%D0%B1%D0%BB%D0%B8%D0%BE%D1%82%D0%B5%D0%BA%D0%B0/%D0%A1%D0%B8%D1%81%D1%82%D0%B5%D0%BC%D0%B0%20%D0%BD%D0%B0%D1%86%D0%B8%D0%BE%D…
requires: Предприятие
requires: Основная деятельность
requires: Вторичная деятельность
term status: draft
broader: Производство
definition: An ancillary activity is a supporting activity undertaken within an enterprise in order to create the conditions within which the principal or secondary activities can be carried out.
definition: Вспомогательная деятельность — это деятельность, осуществляемая внутри предприятия, с целью создания условий для осуществления его основной или вторичной деятельности.
in scheme: Глоссарий
preferred label: Ancillary Activity
related: Предприятие
related: Продукты
related: Товары
related: Выпуск
related: Услуги
related: Производство
related: Вторичная деятельность
top concept of: Глоссарий

Прочие текущие трансферты
type: Concept
source: Система национальных счетов 2008
  source: https://stat.semanticpro.org/xwiki/wiki/NationalAccounts/view/%D0%91%D0%B8%D0%B1%D0%BB%D0%B8%D0%BE%D1%82%D0%B5%D0%BA%D0%B0/%D0%A1%D0%B8%D1%81%D1%82%D0%B5%D0%BC%D0%B0%20%D0%BD%D0%B0%D1%86%D0%B8%D0%BE%D…
requires: Текущие трансферты в рамках сектора государственного управления
requires: Текущий трансферт
requires: Страховое возмещение
requires: Текущие трансферты в рамках международного сотрудничества
term status: draft
definition: Current international cooperation consists of current transfers in cash or in kind between the governments of different countries or between governments and international organizations.
definition: Прочие текущие трансферты включают текущие трансферты, кроме страховых премий и страховых возмещений, <a target="_blank" rel="noopener noreferrer" href="https://stat.semanticpro.org/xwiki/wiki/NationalAccounts/view/%D0%93%D0%BB%D0%BE%D1%81%D1%81%D0%B0%D1%80%D0%B8%D0%B8/%D0%A2%D0%B5%D0%BA%D1%83%D1%89%D0%B8%D0%B5%20%D1%82%D1%80%D0%B0%D0%BD%D1%81%D1%84%D0%B5%D1%80%D1%82%D1%8B%20%D0%B2%20%D1%80%D0%B0%D0%BC%D0%BA%D0%B0%D1%85%20%D1%81%D0%B5%D0%BA%D1%82%D0%BE%D1%80%D0%B0%20%D0%B3%D0%BE%D1%81%D1%83%D0%B4%D0%B0%D1%80%D1%81%D1%82%D0%B2%D0%B5%D0%BD%D0%BD%D0%BE%D0%B3%D0%BE%20%D1%83%D0%BF%D1%80%D0%B0%D0%B2%D0%BB%D0%B5%D0%BD%D0%B8%D1%8F/">текущих трансфертов в рамках сектора государственного управления и <a target="_blank" rel="noopener noreferrer" href="https://stat.semanticpro.org/xwiki/wiki/NationalAccounts/view/%D0%93%D0%BB%D0%BE%D1%81%D1%81%D0%B0%D1%80%D0%B8%D0%B8/%D0%A2%D0%B5%D0%BA%D1%83%D1%89%D0%B8%D0%B5%20%D1%82%D1%80%D0%B0%D0%BD%D1%81%D1%84%D0%B5%D1%80%D1%82%D1%8B%20%D0%B2%20%D1%80%D0%B0%D0%BC%D0%BA%D0%B0%D1%85%20%D0%BC%D0%B5%D0%B6%D0%B4%D1%83%D0%BD%D0%B0%D1%80%D0%BE%D0%B4%D0%BD%D0%BE%D0%B3%D0%BE%20%D1%81%D0%BE%D1%82%D1%80%D1%83%D0%B4%D0%BD%D0%B8%D1%87%D0%B5%D1%81%D1%82%D0%B2%D0%B0/">текущих трансфертов в рамках международного сотрудничества.
in scheme: Глоссарий
preferred label: Current Transfers
top concept of: Глоссарий

Другие депозиты
type: Concept
comment: Типичными формами депозитов, которые должны быть включены в этот раздел, являются сберегательные депозиты (которые всегда являются непереводимыми), срочные депозиты и необращающиеся депозитные сертификаты. Эта категория также включает акции или подобные свидетельства депозита, выпускаемые ссудно-сберегательными ассоциациями, строительными кооперативами, кредитными союзами и т. п. Сюда же относятся депозиты с ограниченной переводимостью, которые не включаются в категорию переводимых депозитов. Требования к МВФ, которые являются компонентами между народных резервов и не считаются ссудами, должны быть отражены как другие депозиты. (Требования к МВФ, считающиеся ссудами, должны быть включены в ссуды.) Подлежащие выплате наличными маржи, связанные с контрактами на производные финансовые инструменты (описанными ниже), включаются в другие депозиты, так же как очень краткосрочные соглашения о продаже ценных бумаг с об ратным выкупом (например, на следующий день), если их считают частью национальной категории денег в широком определении. Другие соглашения о продаже ценных бумаг с обратным выкупом должны классифицироваться как ссуды. Другие депозиты должны классифицироваться в соответствии со следующими характеристиками: номинированы ли депозиты в отечественной валюте или в иностранных валютах являются ли они обязательствами учреждений-резидентов или остального мира.
source: Система национальных счетов 2008
  source: https://stat.semanticpro.org/xwiki/wiki/NationalAccounts/view/%D0%91%D0%B8%D0%B1%D0%BB%D0%B8%D0%BE%D1%82%D0%B5%D0%BA%D0%B0/%D0%A1%D0%B8%D1%81%D1%82%D0%B5%D0%BC%D0%B0%20%D0%BD%D0%B0%D1%86%D0%B8%D0%BE%D…
requires: Переводимые депозиты
term status: draft
definition: Другие депозиты включают все требования за исключением переводимых депозитов, оформленные как депозит.
definition: Other deposits comprise all claims, other than transferable deposits, that are represented by evidence of deposit.
in scheme: Глоссарий
preferred label: Other Deposits
related: Остальной мир
related: Соглашение о продаже ценных бумаг
related: Обязательство
related: Производные финансовые инструменты
related: Переводимые депозиты
related: Ссуды
top concept of: Глоссарий

Ценные бумаги
type: Concept
comment: Securitization may also be used as a term to describe this process. Asset-backed securities may be issued by a specific holding unit or vehicle, which issues securities that are sold to raise funds to pay the originator for the underlying assets. Asset-backed securities are classified as debt securities because the security issuers have a requirement to make payments, while the holders do not have a residual claim on the underlying assets; if they did, the instrument would be equity or investment funds shares. Asset-backed securities are backed by various types of financial assets, for example, mortgages and credit card loans, non-financial assets, or by future income streams (such as the earnings of a musician or a government’s future revenue) that are not recognized in themselves as an economic asset in macroeconomic statistics.
comment: Этот процесс может также называться секьюритизацией. Ценные бумаги, обеспеченные активами, могут выпускаться специальной холдинговой единицей или другой единицей, которые продают их, чтобы мобилизовать средства и заплатить инициатору операции за соответствующие активы. Ценные бумаги, обеспеченные активами, классифицируются как долговые ценные бумаги, потому что эмитенты ценных бумаг должны произвести платежи, в то время как у их держателей нет остаточных требований в отношении активов, служащих обеспечением; если бы они были, то данный инструмент относился бы к категории акционерного капитала или акций инвестиционных фондов. Ценные бумаги, обеспеченные активами, обеспечиваются различными типами финансовых активов, например, ипотечными залогами и ссудами кредитной карты, нефинансовыми активами или потоками будущих доходов (такими как доход музыканта или будущие доходы органа государственного управления), которые не считаются экономическими активами в макроэкономической статистике.
source: Система национальных счетов 2008
  source: https://stat.semanticpro.org/xwiki/wiki/NationalAccounts/view/%D0%91%D0%B8%D0%B1%D0%BB%D0%B8%D0%BE%D1%82%D0%B5%D0%BA%D0%B0/%D0%A1%D0%B8%D1%81%D1%82%D0%B5%D0%BC%D0%B0%20%D0%BD%D0%B0%D1%86%D0%B8%D0%BE%D…
requires: Процент
requires: Обязательство
requires: Актив
term status: draft
definition: Asset-backed securities and collateralized debt obligations are arrangements under which payments of interest and principal are backed by payments on specified assets or income streams.
definition: Ценные бумаги, обеспеченные активами, и обеспеченные залогом долговые обязательства — это такие соглашения, в соответствии с которыми выплаты процентов и основного долга обеспечиваются выплатами определенных активов или потоками доходов.
in scheme: Глоссарий
preferred label: Securities
related: Долговые ценные бумаги
related: Финансовые активы
related: Инвестиционные фонды
related: Операция
related: Акционерный капитал
related: Органы государственного управления
related: Актив
related: Ссуды
top concept of: Глоссарий

Оригиналы развлекательных, литературных и художественных произведений
type: Concept
source: Система национальных счетов 2008
  source: https://stat.semanticpro.org/xwiki/wiki/NationalAccounts/view/%D0%91%D0%B8%D0%B1%D0%BB%D0%B8%D0%BE%D1%82%D0%B5%D0%BA%D0%B0/%D0%A1%D0%B8%D1%81%D1%82%D0%B5%D0%BC%D0%B0%20%D0%BD%D0%B0%D1%86%D0%B8%D0%BE%D…
term status: draft
definition: Entertainment, literary and artistic originals consist of the original films, sound recordings, manuscripts, tapes, models, etc., on which drama performances, radio and television programming, musical performances, sporting events, literary and artistic output, etc., are recorded or embodied.
definition: Оригиналы развлекательных, литературных и художественных произведений включают оригиналы кинофильмов, звукозаписей, рукописей, пленок, моделей и т. д., на которых записаны или воплощены драматические спектакли, радио- и телевизионные программы, музыкальные представления, спортивные мероприятия, литературные и художественные произведения и т. д.
in scheme: Глоссарий
preferred label: Entertainment, Literary and Artistic Originals
top concept of: Глоссарий

Валовый внутренний продукт
type: Concept
comment: Есть три разных метода определения ВВП: а. оценка валового внутреннего продукта производственным методом; b. оценка <a target="_blank" rel="noopener noreferrer" href="https://stat.semanticpro.org/xwiki/wiki/NationalAccounts/view/%D0%93%D0%BB%D0%BE%D1%81%D1%81%D0%B0%D1%80%D0%B8%D0%B8/%D0%92%D0%92%D0%9F%20%D0%B8%D1%81%D1%87%D0%B8%D1%81%D0%BB%D0%B5%D0%BD%D0%BD%D1%8B%D0%B9%20%D0%BC%D0%B5%D1%82%D0%BE%D0%B4%D0%BE%D0%BC%20%D0%BA%D0%BE%D0%BD%D0%B5%D1%87%D0%BD%D0%BE%D0%B3%D0%BE%20%D0%B8%D1%81%D0%BF%D0%BE%D0%BB%D1%8C%D0%B7%D0%BE%D0%B2%D0%B0%D0%BD%D0%B8%D1%8F/">валового внутреннего продукта методом конечного использования; с. оценка <a target="_blank" rel="noopener noreferrer" href="https://stat.semanticpro.org/xwiki/wiki/NationalAccounts/view/%D0%93%D0%BB%D0%BE%D1%81%D1%81%D0%B0%D1%80%D0%B8%D0%B8/%D0%92%D0%92%D0%9F%20%D0%B8%D1%81%D1%87%D0%B8%D1%81%D0%BB%D0%B5%D0%BD%D0%BD%D1%8B%D0%B9%20%D1%80%D0%B0%D1%81%D0%BF%D1%80%D0%B5%D0%B4%D0%B5%D0%BB%D0%B8%D1%82%D0%B5%D0%BB%D1%8C%D0%BD%D1%8B%D0%BC%20%D0%BC%D0%B5%D1%82%D0%BE%D0%B4%D0%BE%D0%BC/">валового внутреннего продукта распределительным методом.
source: Система национальных счетов 2008
  source: https://stat.semanticpro.org/xwiki/wiki/NationalAccounts/view/%D0%91%D0%B8%D0%B1%D0%BB%D0%B8%D0%BE%D1%82%D0%B5%D0%BA%D0%B0/%D0%A1%D0%B8%D1%81%D1%82%D0%B5%D0%BC%D0%B0%20%D0%BD%D0%B0%D1%86%D0%B8%D0%BE%D…
requires: Цена
requires: Производство
term status: draft
alternative label: ВВП
alternative label: GDP
definition: Валовой внутренний продукт (ВВП) представляет собой конечный результат производственной деятельности резидентных единиц-производителей в течение данного периода времени и исчисляется в рыночных ценах.
in scheme: Глоссарий
preferred label: Gross Domestic Product
related: ВВП, исчисленный методом конечного использования
related: ВВП, исчисленный производственным методом
related: ВВП, исчисленный распределительным методом
top concept of: Глоссарий

Услуги
type: Concept
comment: Индивидуальные товары и услуги, как правило, приобретаются и продаются на рынке, хотя они могут также предоставляться бесплатно или в ценах, которые не являются экономически значимыми, например, товары и услуги, предоставляемые в качестве <a target="_blank" rel="noopener noreferrer" href="https://stat.semanticpro.org/xwiki/wiki/NationalAccounts/view/%D0%93%D0%BB%D0%BE%D1%81%D1%81%D0%B0%D1%80%D0%B8%D0%B8/%D0%A1%D0%BE%D1%86%D0%B8%D0%B0%D0%BB%D1%8C%D0%BD%D1%8B%D0%B5%20%D1%82%D1%80%D0%B0%D0%BD%D1%81%D1%84%D0%B5%D1%80%D1%82%D1%8B%20%D0%B2%20%D0%BD%D0%B0%D1%82%D1%83%D1%80%D0%B0%D0%BB%D1%8C%D0%BD%D0%BE%D0%B9%20%D1%84%D0%BE%D1%80%D0%BC%D0%B5/">социальных трансфертов в натуральной форме. На практике все товары и большинство услуг являются индивидуальными.
source: Система национальных счетов 2008
  source: https://stat.semanticpro.org/xwiki/wiki/NationalAccounts/view/%D0%91%D0%B8%D0%B1%D0%BB%D0%B8%D0%BE%D1%82%D0%B5%D0%BA%D0%B0/%D0%A1%D0%B8%D1%81%D1%82%D0%B5%D0%BC%D0%B0%20%D0%BD%D0%B0%D1%86%D0%B8%D0%BE%D…
requires: Продукты
requires: Финансовые активы
requires: Производство
term status: draft
broader: Продукты
definition: Услуги — это результат производственной деятельности, который меняет состояние потребляющих единиц или содействует обмену продуктами или финансовыми активами.
definition: Services are the result of a production activity that changes the conditions of the consuming units, or facilitates the exchange of products or financial assets.
in scheme: Глоссарий
preferred label: Services
related: Цена
related: Товары
related: Социальные трансферты в натуральной форме
top concept of: Глоссарий

Экономический собственник
type: Concept
comment: У каждого объекта есть как юридический собственник, так и экономический собственник, хотя во многих случаях экономический собственник и юридический собственник объекта - одна и та же единица. Если это не так, то юридический собственник передает ответственность за риск, связанный с использованием объекта в экономической деятельности, экономическому собственнику вместе со связанными с этим экономическими выгодами. Взамен юридический собственник принимает другой пакет рисков и выгод от экономического собственника.
source: Система национальных счетов 2008
  source: https://stat.semanticpro.org/xwiki/wiki/NationalAccounts/view/%D0%91%D0%B8%D0%B1%D0%BB%D0%B8%D0%BE%D1%82%D0%B5%D0%BA%D0%B0/%D0%A1%D0%B8%D1%81%D1%82%D0%B5%D0%BC%D0%B0%20%D0%BD%D0%B0%D1%86%D0%B8%D0%BE%D…
requires: Товары
requires: Институциональная единица
requires: Финансовые активы
requires: Обязательство
requires: Услуги
requires: Природные ресурсы
term status: draft
definition: Экономический собственник объектов, таких как товары и услуги, природные ресурсы, финансовые активы и обязательства — это институциональная единица, которая имеет право предъявлять требования на получение экономических выгод, связанных с использованием упомянутых объектов в ходе экономической деятельности благодаря принятию связанных с этим рисков.
definition: The economic owner of entities such as goods and services, natural resources, financial assets and liabilities is the institutional unit entitled to claim the benefits associated with the use of the entity inquestion in the course of an economic activity by virtue of accepting the associated risks.
in scheme: Глоссарий
preferred label: Economic Owner
related: Юридический собственник
top concept of: Глоссарий

Инвестиционные гранты
type: Concept
comment: Получатели обязаны использовать инвестиционные гранты в целях валового накопления основного капитала, и гранты часто предназначены для финансирования конкретных инвестиционных проектов, таких как крупные правительственные проекты. Если инвестиционный проект продолжается длительное время, инвестиционный грант в денежной форме может быть выплачен в виде серии платежей. Отдельные частичные платежи продолжают классифицироваться как капитальные трансферты даже при том, что они могут быть отражены в счетах в различных последовательных отчетных периодах.
source: Система национальных счетов 2008
  source: https://stat.semanticpro.org/xwiki/wiki/NationalAccounts/view/%D0%91%D0%B8%D0%B1%D0%BB%D0%B8%D0%BE%D1%82%D0%B5%D0%BA%D0%B0/%D0%A1%D0%B8%D1%81%D1%82%D0%B5%D0%BC%D0%B0%20%D0%BD%D0%B0%D1%86%D0%B8%D0%BE%D…
requires: Институциональная единица
requires: Органы государственного управления
requires: Капитальные трансферты
term status: draft
definition: Investment grants consist of capital transfers made by governments to other resident or non-resident institutional units to finance all or part of the costs of their acquiring fixed assets.
definition: Инвестиционные гранты включают капитальные трансферты, предоставленные органами государственного управления другим институциональным единицам — резидентам или нерезидентам — для финансированиях всех или части их издержек на приобретение основных фондов.
in scheme: Глоссарий
preferred label: Investment Grants
related: Валовое накопление основного капитала
related: Капитальные трансферты
top concept of: Глоссарий

Номинальная холдинговая прибыль на финансовый актив
type: Concept
source: Система национальных счетов 2008
  source: https://stat.semanticpro.org/xwiki/wiki/NationalAccounts/view/%D0%91%D0%B8%D0%B1%D0%BB%D0%B8%D0%BE%D1%82%D0%B5%D0%BA%D0%B0/%D0%A1%D0%B8%D1%81%D1%82%D0%B5%D0%BC%D0%B0%20%D0%BD%D0%B0%D1%86%D0%B8%D0%BE%D…
requires: Операция
requires: Процент
requires: Актив
term status: draft
definition: The nominal holding gain on a financial asset is the increase in value of the asset, other than transactions in the assets (including the accrual of interest over a period of time) and other changes in the volume of assets.
definition: Номинальная холдинговая прибыль на финансовый актив — это увеличение стоимости актива, не являющееся результатом операций с активами (включая поступление процентов за период времени) и других изменений в объеме активов.
in scheme: Глоссарий
preferred label: The nominal holding gain on a financial asset
top concept of: Глоссарий

Экономические потоки
type: Concept
comment: Отражая разнообразие в экономике, экономические потоки имеют конкретный вид, такой как оплата труда, налоги, проценты, потоки капитала и так далее, которые отражают способы, с помощью которых происходят изменения в активах и обязательствах единицы.
source: Система национальных счетов 2008
  source: https://stat.semanticpro.org/xwiki/wiki/NationalAccounts/view/%D0%91%D0%B8%D0%B1%D0%BB%D0%B8%D0%BE%D1%82%D0%B5%D0%BA%D0%B0/%D0%A1%D0%B8%D1%81%D1%82%D0%B5%D0%BC%D0%B0%20%D0%BD%D0%B0%D1%86%D0%B8%D0%BE%D…
requires: Трансферт
requires: Институциональная единица
requires: Обязательство
requires: Актив
term status: draft
definition: Economic flows reflect the creation, transformation, exchange, transfer or extinction of economic value; they involve changes in the volume, composition, or value of an institutional unit’s assets and liabilities.
definition: Экономические потоки отражают создание, трансформацию, обмен, трансферт или исчезновение экономической стоимости. Они предполагают изменения в объеме, структуре или стоимости активов и обязательств институциональной единицы.
in scheme: Глоссарий
preferred label: Economic flows
related: Оплата труда
related: Налоги
related: Обязательство
related: Процент
related: Актив
top concept of: Глоссарий

Специальные права заимствования
type: Concept
comment: The Special Drawing Rights Department of the IMF manages reserve assets by allocating SDRs among member countries of the IMF and certain international agencies (collectively known as the participants).
comment: Департамент специальных прав заимствования МВФ управляет резервными активами, распределяя СПЗ среди государств-членов МВФ и некоторых международных организаций (называемых вместе участниками).
source: Система национальных счетов 2008
  source: https://stat.semanticpro.org/xwiki/wiki/NationalAccounts/view/%D0%91%D0%B8%D0%B1%D0%BB%D0%B8%D0%BE%D1%82%D0%B5%D0%BA%D0%B0/%D0%A1%D0%B8%D1%81%D1%82%D0%B5%D0%BC%D0%B0%20%D0%BD%D0%B0%D1%86%D0%B8%D0%BE%D…
requires: Резервные активы
term status: draft
alternative label: СПЗ
alternative label: SDRs
definition: Специальные права заимствования (СПЗ) являются международными резервными активами, которые создаются Международным валютным фондом (МВФ) и распределяются среди его членов в дополнение к имеющимся резервным активам.
definition: Special Drawing Rights (SDRs) are international reserve assets created by the International Monetary Fund (IMF) and allocated to its members to supplement existing reserve assets.
in scheme: Глоссарий
preferred label: Special Drawing Rights
related: Резервные активы
top concept of: Глоссарий

Отрасль
type: Concept
comment: Отрасль (на самом дезагрегированном уровне классификации) состоит из всех заведений, охватываемых одной подгруппой Международной стандартной отраслевой классификации (МСОК). На более агрегированных уровнях классификации, то есть на уровне групп, подразделов и разделов МСОК, отрасли состоят из групп заведений, занимающихся аналогичными видами деятельности.
source: Система национальных счетов 2008
  source: https://stat.semanticpro.org/xwiki/wiki/NationalAccounts/view/%D0%91%D0%B8%D0%B1%D0%BB%D0%B8%D0%BE%D1%82%D0%B5%D0%BA%D0%B0/%D0%A1%D0%B8%D1%81%D1%82%D0%B5%D0%BC%D0%B0%20%D0%BD%D0%B0%D1%86%D0%B8%D0%BE%D…
requires: Заведение
term status: draft
definition: An industry consists of a group of establishments engaged in the same, or similar, kinds of activity.
definition: Отрасль представляет собой группу заведений, занимающихся одним и тем же или аналогичными видами деятельности.
in scheme: Глоссарий
preferred label: Industry
related: Заведение
top concept of: Глоссарий

Арендная плата
type: Concept
comment: Арендная плата должна быть достаточно значительной, чтобы возместить: любые прямые затраты, понесенные собственником, включая затраты по поддержанию активов в нормальном состоянии уменьшение стоимости активов в течение данного периода (потребление основного капитала) и выплаты процента на стоимость активов на начало данного периода. Выплаты процента могут включать либо фактически выплаченный процент на полученную ссуду или потерю процента в результате инвестирования собственных средств в покупку основных фондов вместо приобретения финансового актива. Независимо от того, являются ли основные фонды собственностью производителя или получены им в аренду, полная величина затрат, связанных с использованием основных фондов в производстве, измеряется фактической или условно исчисленной арендной платой за актив, а не только потреблением основного капитала. В том случае, если актив фактически арендуется по договору операционного лизинга или аналогичному контракту, арендная плата отражается как статья промежуточного потребления в виде покупок услуг, предоставленных арендодателем. В том случае, если собственник и единица, использующая основные фонды, являются одной и той же единицей, прямые затраты отражаются как промежуточное потребление.
source: Система национальных счетов 2008
  source: https://stat.semanticpro.org/xwiki/wiki/NationalAccounts/view/%D0%91%D0%B8%D0%B1%D0%BB%D0%B8%D0%BE%D1%82%D0%B5%D0%BA%D0%B0/%D0%A1%D0%B8%D1%81%D1%82%D0%B5%D0%BC%D0%B0%20%D0%BD%D0%B0%D1%86%D0%B8%D0%BE%D…
requires: Договор операционного лизинга
requires: Основные фонды
requires: Актив
requires: Производство
term status: draft
alternative label: Rental Income
definition: The rental is the amount payable by the user of a fixed asset to its owner, under an operating lease or similar contract, for the right to use that asset in production for a specified period of time.
definition: Арендная плата представляет собой сумму, подлежащую выплате единицей, использующей основные фонды, их собственнику в соответствии с договором операционного лизинга или аналогичным контрактом за право использовать эти активы в производстве в течение определенного периода времени.
in scheme: Глоссарий
preferred label: Rental
related: Договор операционного лизинга
related: Потребление основного капитала
related: Промежуточное потребление
related: Процент
related: Основные фонды
related: Актив
related: Производство
related: Услуги
related: Ссуды
top concept of: Глоссарий

Право на получение в будущем товаров и услуг на исключительной основе
type: Concept
comment: Примерами являются контракты футболистов, исключительное право издателя на публикацию новых произведений определенного автора или на выпуск звукозаписи известных музыкантов.
comment: Examples are footballers’ contracts, a publisher’s exclusive right to publish new works by a named author or issue recordings by named musicians.
source: Система национальных счетов 2008
  source: https://stat.semanticpro.org/xwiki/wiki/NationalAccounts/view/%D0%91%D0%B8%D0%B1%D0%BB%D0%B8%D0%BE%D1%82%D0%B5%D0%BA%D0%B0/%D0%A1%D0%B8%D1%81%D1%82%D0%B5%D0%BC%D0%B0%20%D0%BD%D0%B0%D1%86%D0%B8%D0%BE%D…
requires: Цена
requires: Товары
requires: Обязательство
requires: Услуги
term status: draft
definition: Entitlement to future goods and services on an exclusive basis relates to the case where one party which has contracted to purchase goods or services at a fixed price at a time in the future is able to transfer the obligation of the second party to the contract to a third party.
definition: Право на получение в будущем товаров и услуг на исключительной основе относится к случаю, когда одна сторона, которая заключила контракт, чтобы купить товары или услуги по фиксированной цене в будущем, может передать обязательство второй стороны контракта третьей стороне.
in scheme: Глоссарий
preferred label: Entitlement to Future Goods and Services on an Exclusive Basis
top concept of: Глоссарий

Маркетинговые активы
type: Concept
comment: Бренд может интерпретироваться как нечто большее, чем только название корпорации или ее логотип. Это общее впечатление, которое получает клиент или потенциальный клиент от общения с компанией и ее продуктами. Интерпретация данного понятия в более широком смысле позволяет охватить некоторые из особенностей гудвилла, такие как лояльность клиентов.
source: Система национальных счетов 2008
  source: https://stat.semanticpro.org/xwiki/wiki/NationalAccounts/view/%D0%91%D0%B8%D0%B1%D0%BB%D0%B8%D0%BE%D1%82%D0%B5%D0%BA%D0%B0/%D0%A1%D0%B8%D1%81%D1%82%D0%B5%D0%BC%D0%B0%20%D0%BD%D0%B0%D1%86%D0%B8%D0%BE%D…
term status: draft
definition: Marketing assets consist of items such as brand names, mastheads, trademarks, logos and domain names.
definition: Маркетинговые активы состоят из таких объектов, как названия брендов, торговые марки, логотипы и имена доменов.
in scheme: Глоссарий
preferred label: Marketing Assets
related: Продукты
related: Корпорация
top concept of: Глоссарий

Репо
type: Concept
source: Система национальных счетов 2008
  source: https://stat.semanticpro.org/xwiki/wiki/NationalAccounts/view/%D0%91%D0%B8%D0%B1%D0%BB%D0%B8%D0%BE%D1%82%D0%B5%D0%BA%D0%B0/%D0%A1%D0%B8%D1%81%D1%82%D0%B5%D0%BC%D0%B0%20%D0%BD%D0%B0%D1%86%D0%B8%D0%BE%D…
requires: Цена
requires: Ценные бумаги
requires: Соглашение о продаже ценных бумаг
requires: Обязательство
term status: draft
definition: Репо — это соглашение о продаже ценных бумаг с последующим выкупом, в соответствии с которым ценные бумаги предоставляются в обмен на наличные деньги с обязательством выкупить те же или аналогичные ценные бумаги за наличные деньги по фиксированной цене в определенную дату в будущем.
definition: A repo is a securities repurchase agreement where securities are provided for cash with a commitment to repurchase the same or similar securities for cash at a fixed price on a specified future date.
in scheme: Глоссарий
preferred label: Repo
top concept of: Глоссарий

Валовое накопление
type: Concept
comment: It is possible (if uncommon) for the gross capital formation of an individual institutional unit or sector to be negative if it sells off enough of its existing assets to other units or sectors.
comment: Возможно (хотя и редко), что валовое накопление отдельной институциональной единицы или сектора будет отрицательным, если они продают достаточно много своих существующих активов другим институциональным единицам или секторам.
source: Система национальных счетов 2008
  source: https://stat.semanticpro.org/xwiki/wiki/NationalAccounts/view/%D0%91%D0%B8%D0%B1%D0%BB%D0%B8%D0%BE%D1%82%D0%B5%D0%BA%D0%B0/%D0%A1%D0%B8%D1%81%D1%82%D0%B5%D0%BC%D0%B0%20%D0%BD%D0%B0%D1%86%D0%B8%D0%BE%D…
requires: Материальные оборотные средства
requires: Актив
requires: Ценности
term status: draft
definition: Валовое накопление включает приобретение произведенных активов (за вычетом выбытия) в целях накопления основного капитала, материальных оборотных средств или ценностей.
definition: Gross capital formation shows the acquisition less disposal of produced assets for purposes of fixed capital formation, inventories or valuables.
in scheme: Глоссарий
preferred label: Gross Capital Formation
related: Институциональная единица
related: Актив
top concept of: Глоссарий

Условия внешней торговли
type: Concept
comment: Если цены экспорта страны растут быстрее (или падают медленнее), чем цены ее импорта (то есть, если условия ее внешней торговли улучшаются), то необходимо меньше экспорта, чтобы оплатить данный объем импорта, так что при данном уровне отечественного производства товары и услуги могут быть перераспределены от экспорта к потреблению и валовому накоплению капитала. Таким образом, улучшение условий торговли позволяет резидентам покупать больший объем товаров и услуг на доходы, произведенные при данном уровне отечественного производства.
comment: If the prices of a country’s exports rise faster (or fall more slowly) than the prices of its imports (that is, if its terms of trade improve) fewer exports are needed to pay for a given volume of imports so that at a given level of domestic production goods and services can be reallocated from exports to consumption or capital formation. Thus, an improvement in the terms of trade makes it possible for an increased volume of goods and services to be purchased by residents out of the incomes generated by a given level of domestic production.
source: Система национальных счетов 2008
  source: https://stat.semanticpro.org/xwiki/wiki/NationalAccounts/view/%D0%91%D0%B8%D0%B1%D0%BB%D0%B8%D0%BE%D1%82%D0%B5%D0%BA%D0%B0/%D0%A1%D0%B8%D1%81%D1%82%D0%B5%D0%BC%D0%B0%20%D0%BD%D0%B0%D1%86%D0%B8%D0%BE%D…
requires: Цена
term status: draft
definition: Условия внешней торговли определяются как отношение цены экспорта к цене импорта.
definition: The terms of trade are defined as the ratio of the price of exports to the price of imports.
in scheme: Глоссарий
preferred label: Terms of Trade
related: Цена
related: Товары
related: Потребление
related: Валовое накопление
related: Производство
related: Услуги
top concept of: Глоссарий

Неработающая ссуда
type: Concept
source: Система национальных счетов 2008
  source: https://stat.semanticpro.org/xwiki/wiki/NationalAccounts/view/%D0%91%D0%B8%D0%B1%D0%BB%D0%B8%D0%BE%D1%82%D0%B5%D0%BA%D0%B0/%D0%A1%D0%B8%D1%81%D1%82%D0%B5%D0%BC%D0%B0%20%D0%BD%D0%B0%D1%86%D0%B8%D0%BE%D…
requires: Процент
term status: draft
broader: Ссуды
definition: Ссуда является неработающей, если выплаты процентов или основного долга просрочены на 90 дней или больше, или процентные платежи за срок, равный 90 дням или больше, были капитализированы, рефинансированы или отсрочены по соглашению, или выплаты просрочены менее, чем на 90 дней, но есть другие серьезные основания для сомнения в том, что платежи будут произведены полностью (такие, как заявление о банкротстве дебитора).
definition: A loan is non-performing when payments of interest or principal are past due by 90 days or more, or interest payments equal to 90 days or more have been capitalized, refinanced, or delayed by agreement, or payments are less than 90 days overdue, but there are other good reasons (such as a debtor filing for bankruptcy) to doubt that payments will be made in full.
in scheme: Глоссарий
preferred label: Non-Performing Loan
top concept of: Глоссарий

Субсидия на продукт
type: Concept
comment: Субсидия может быть конкретной денежной суммой на единицу количества товара или услуги, либо она может рассчитываться как определенный процент от общей стоимости или цены единицы продукта. Размер субсидии можно также вычислить как разницу между конкретной целевой ценой и рыночной ценой, фактически уплаченной покупателем. Обычно субсидия на продукт подлежит выплате, когда товар или услуга произведены, проданы или импортированы. Кроме того, субсидия может подлежать выплате в других обстоятельствах (напри мер, когда происходит трансферт, аренда, поставка или использование товара для собственного потребления или накопления.
source: Система национальных счетов 2008
  source: https://stat.semanticpro.org/xwiki/wiki/NationalAccounts/view/%D0%91%D0%B8%D0%B1%D0%BB%D0%B8%D0%BE%D1%82%D0%B5%D0%BA%D0%B0/%D0%A1%D0%B8%D1%81%D1%82%D0%B5%D0%BC%D0%B0%20%D0%BD%D0%B0%D1%86%D0%B8%D0%BE%D…
requires: Товары
requires: Субсидии
requires: Услуги
term status: draft
broader: Субсидии
definition: A subsidy on a product is a subsidy payable per unit of a good or service.
definition: Субсидия на продукт — это субсидия, выплачиваемая за единицу товара или услуги.
in scheme: Глоссарий
preferred label: Subsidy On Product
related: Цена
related: Продукты
related: Товары
related: Трансферт
related: Субсидии
related: Потребление
related: Процент
related: Услуги
top concept of: Глоссарий

Информационное, компьютерное и телекоммуникационное оборудование
type: Concept
comment: Примерами являются продукты, включенные в CPC-2.0 в группы 452 и 472. На практике охват ИКТ включает, главным образом, компьютерную технику и телекоммуникационное оборудование.
source: Система национальных счетов 2008
  source: https://stat.semanticpro.org/xwiki/wiki/NationalAccounts/view/%D0%91%D0%B8%D0%B1%D0%BB%D0%B8%D0%BE%D1%82%D0%B5%D0%BA%D0%B0/%D0%A1%D0%B8%D1%81%D1%82%D0%B5%D0%BC%D0%B0%20%D0%BD%D0%B0%D1%86%D0%B8%D0%BE%D…
term status: draft
alternative label: Information, Computer and Telecommunications (ICT) Equipment
alternative label: ИКТ оборудование
broader: Машины и оборудование
definition: Information, computer and telecommunications (ICT) equipment consists of devices using electronic controls and also the electronic components forming part of these devices.
definition: Информационное, компьютерное и телекоммуникационное (ИКТ) оборудование включает устройства, использующие электронные средства управления, и электронные компоненты, являющиеся частью этих устройств.
in scheme: Глоссарий
preferred label: Information, Computer and Telecommunications Equipment
related: Продукты
top concept of: Глоссарий

Другие инвестиции
type: Concept
comment: Эта категория включает следующие финансовые инструменты: другие виды участия в капитале наличная валюта и депозиты ссуды (включая использование кредитов и ссуд, полученных от МВФ) страховые технические резервы (кроме резервов по страхованию жизни), права на получение выплат по страхованию жизни и аннуитетам, права на пенсионные пособия и резервы для урегулирования требований по стандартизированным гарантиям коммерческие кредиты и авансы прочая дебиторская/кредиторская задолженность (исключая коммерческие кредиты и авансы) размещенные СПЗ (активы в форме СПЗ включены в резервные активы).
source: Система национальных счетов 2008
  source: https://stat.semanticpro.org/xwiki/wiki/NationalAccounts/view/%D0%91%D0%B8%D0%B1%D0%BB%D0%B8%D0%BE%D1%82%D0%B5%D0%BA%D0%B0/%D0%A1%D0%B8%D1%81%D1%82%D0%B5%D0%BC%D0%B0%20%D0%BD%D0%B0%D1%86%D0%B8%D0%BE%D…
requires: Опцион на приобретение акций работниками
requires: Прямые инвестиции
requires: Операция
requires: Производные финансовые инструменты
requires: Резервные активы
requires: Портфельные инвестиции
term status: draft
definition: Other investment is a residual category that includes positions and transactions other than those included in direct investment, portfolio investment, financial derivatives and employee stock options and reserve assets.
definition: Другие инвестиции — это категория, получаемая остаточным путем, которая охватывает позиции и операции, не включенные в прямые инвестиции, портфельные инвестиции, производные финансовые инструменты, опционы на приобретение акций работниками и резервные активы.
in scheme: Глоссарий
preferred label: Other Investment
related: Резервы для урегулирования требований
related: Права на пенсионные пособия
related: Страховые технические резервы
related: Специальные права заимствования
related: Страхование жизни
related: Резервные активы
related: Актив
related: Ссуды
top concept of: Глоссарий

Импортные пошлины
type: Concept
comment: Размер импортных пошлин определяется на основе таможенных тарифных ставок. Пошлины могут использоваться для увеличения доходов или для ограничения импорта в целях защиты отечественных производителей (РСГФ-2001, 1151; ОЭСР, 5123).
source: Система национальных счетов 2008
  source: https://stat.semanticpro.org/xwiki/wiki/NationalAccounts/view/%D0%91%D0%B8%D0%B1%D0%BB%D0%B8%D0%BE%D1%82%D0%B5%D0%BA%D0%B0/%D0%A1%D0%B8%D1%81%D1%82%D0%B5%D0%BC%D0%B0%20%D0%BD%D0%B0%D1%86%D0%B8%D0%BE%D…
requires: Товары
term status: draft
definition: Import duties consist of customs duties, or other import charges, that are payable on goods of a particular type when they enter the economic territory.
definition: Импортные пошлины включают таможенные пошлины и другие сборы по импорту, подлежащие уплате с товаров определенного типа при их поступлении на экономическую территорию страны.
in scheme: Глоссарий
preferred label: Import Duties
top concept of: Глоссарий

Трансферт
type: Concept
comment: Трансферты подразделяются на текущие и капитальные трансферты.
source: Система национальных счетов 2008
  source: https://stat.semanticpro.org/xwiki/wiki/NationalAccounts/view/%D0%91%D0%B8%D0%B1%D0%BB%D0%B8%D0%BE%D1%82%D0%B5%D0%BA%D0%B0/%D0%A1%D0%B8%D1%81%D1%82%D0%B5%D0%BC%D0%B0%20%D0%BD%D0%B0%D1%86%D0%B8%D0%BE%D…
requires: Товары
requires: Институциональная единица
requires: Операция
requires: Актив
requires: Услуги
term status: draft
definition: A transfer is a transaction in which one institutional unit provides a good, service or asset to another unit without receiving from the latter any good, service or asset in return as a direct counterpart.
definition: Трансферт — это операция, в результате которой одна институциональная единица предоставляет другой единице товар, услугу или актив, не получая от нее взамен никакого товара, услуги или актива в качестве прямого эквивалента.
in scheme: Глоссарий
preferred label: Transfer
related: Текущий трансферт
related: Капитальные трансферты
top concept of: Глоссарий

Пособия по социальному обеспечению в денежной форме
type: Concept
source: Система национальных счетов 2008
  source: https://stat.semanticpro.org/xwiki/wiki/NationalAccounts/view/%D0%91%D0%B8%D0%B1%D0%BB%D0%B8%D0%BE%D1%82%D0%B5%D0%BA%D0%B0/%D0%A1%D0%B8%D1%81%D1%82%D0%B5%D0%BC%D0%B0%20%D0%BD%D0%B0%D1%86%D0%B8%D0%BE%D…
requires: Домашнее хозяйство
requires: Пособие по социальному страхованию
term status: draft
broader: Пособие по социальному страхованию
definition: Social security benefits in cash are social insurance benefits payable in cash to households by social security funds.
definition: Пособия по социальному обеспечению в денежной форме — это пособия по социальному страхованию, подлежащие выплате домашним хозяйствам в денежной форме фондами социального обеспечения.
in scheme: Глоссарий
preferred label: Social Security Benefits In Cash
top concept of: Глоссарий

Юридический собственник
type: Concept
comment: У каждого объекта есть как юридический собственник, так и экономический собственник, хотя во многих случаях экономический собственник и юридический собственник объекта - одна и та же единица. Если это не так, то юридический собственник передает ответственность за риск, связанный с использованием объекта в экономической деятельности, экономическому собственнику вместе со связанными с этим экономическими выгодами. Взамен юридический собственник принимает другой пакет рисков и выгод от экономического собственника.
source: Система национальных счетов 2008
  source: https://stat.semanticpro.org/xwiki/wiki/NationalAccounts/view/%D0%91%D0%B8%D0%B1%D0%BB%D0%B8%D0%BE%D1%82%D0%B5%D0%BA%D0%B0/%D0%A1%D0%B8%D1%81%D1%82%D0%B5%D0%BC%D0%B0%20%D0%BD%D0%B0%D1%86%D0%B8%D0%BE%D…
requires: Институциональная единица
requires: Актив
term status: draft
definition: The legal owner of entities such as goods and services, natural resources, financial assets and liabilities is the institutional unit entitled in law and sustainable under the law to claim the benefits associated with the entities.
definition: Юридическим собственником объектов, таких как товары и услуги, природные ресурсы, финансовые активы и обязательства является институциональная единица, имеющая по закону и поддерживаемое законодательно право предъявлять требования на получение экономических выгод, связанных с этими объектами.
in scheme: Глоссарий
preferred label: Legal Owner
related: Экономический собственник
top concept of: Глоссарий

Субсидии на импорт
type: Concept
comment: Они включают субсидии, подлежащие выплате в неявной форме, возникающие в результате функционирования системы множественных официальных курсов валют. Они также могут включать возмещение потерь государственных внешнеторговых организаций, специализирующихся на закупках продукции у нерезидентов и ее последующей продаже по более низким ценам резидентам, если такие потери являются результатом целенаправленной политики органов государственного управления.
source: Система национальных счетов 2008
  source: https://stat.semanticpro.org/xwiki/wiki/NationalAccounts/view/%D0%91%D0%B8%D0%B1%D0%BB%D0%B8%D0%BE%D1%82%D0%B5%D0%BA%D0%B0/%D0%A1%D0%B8%D1%81%D1%82%D0%B5%D0%BC%D0%B0%20%D0%BD%D0%B0%D1%86%D0%B8%D0%BE%D…
requires: Товары
requires: Институциональная единица
requires: Субсидии
requires: Услуги
term status: draft
definition: Import subsidies consist of subsidies on goods and services that become payable when the goods cross the frontier of the economic territory or when the services are delivered to resident institutional units.
definition: Субсидии на импорт включают субсидии на товары и услуги, подлежащие уплате при пересечении товарами границы экономической территории страны или при оказании услуг институциональным единицам-резидентам нерезидентами.
in scheme: Глоссарий
preferred label: Import subsidies
related: Цена
related: Продукты
related: Субсидии
related: Органы государственного управления
top concept of: Глоссарий

Другие сооружения
type: Concept
comment: Включаются также издержки на расчистку и подготовку участка для строительства. Включаются также исторические памятники, которые не могут быть идентифицированы как жилые здания или нежилые здания, например, шахты, туннели и другие сооружения, связанные с добычей минеральных и энергетических ресурсов, постройки волнорезов, дамб, насыпей от затопления и т. д., которые предназначены для улучшения качества и увеличения количества прилегающих земель. Также включается инфраструктура, необходимая для хозяйств аквакультуры, таких как рыбоводческие хозяйства или места для разведения моллюсков.
source: Система национальных счетов 2008
  source: https://stat.semanticpro.org/xwiki/wiki/NationalAccounts/view/%D0%91%D0%B8%D0%B1%D0%BB%D0%B8%D0%BE%D1%82%D0%B5%D0%BA%D0%B0/%D0%A1%D0%B8%D1%81%D1%82%D0%B5%D0%BC%D0%B0%20%D0%BD%D0%B0%D1%86%D0%B8%D0%BE%D…
term status: draft
broader: Другие здания и сооружения
definition: Other structures include structures other than buildings, including the cost of the streets, sewer, etc.
definition: Другие сооружения включают сооружения, кроме зданий, такие как улицы, канализационные системы и т. д.
in scheme: Глоссарий
preferred label: Other Structures
related: Земля
related: Жилые здания
related: Исторические памятники
related: Нежилые здания
top concept of: Глоссарий

Нейтральная холдинговая прибыль (убыток) за период
type: Concept
source: Система национальных счетов 2008
  source: https://stat.semanticpro.org/xwiki/wiki/NationalAccounts/view/%D0%91%D0%B8%D0%B1%D0%BB%D0%B8%D0%BE%D1%82%D0%B5%D0%BA%D0%B0/%D0%A1%D0%B8%D1%81%D1%82%D0%B5%D0%BC%D0%B0%20%D0%BD%D0%B0%D1%86%D0%B8%D0%BE%D…
requires: Товары
requires: Операция
requires: Актив
requires: Услуги
term status: draft
definition: Нейтральная холдинговая прибыль (убыток) за период представляет собой увеличение (уменьшение) стоимости актива, которое потребовалось бы, чтобы в отсутствие операций и других изменений в объеме активов приобрести такое же количество товаров и услуг, как в начале периода.
definition: A neutral holding gain (loss) over a period is the increase (decrease) in the value of an asset that would be required, in the absence of transactions and other changes in the volume of assets, to maintain command over the same amount of goods and services as at the beginning of the period.
in scheme: Глоссарий
preferred label: Neutral Holding Gain Over A Period
top concept of: Глоссарий

Валовое накопление основного капитала в форме конкретной категории основных фондов
type: Concept
comment: Валовое накопление основного капитала не отражается в счетах до тех пор, пока право собственности в отношении основных фондов не передано той единице, которая имеет в виду использовать их в производстве, если только данные объекты основных фондов не производятся в соответствии с ранее заключенным контрактом. Таким образом, новые активы, которые еще не были проданы, являются частью запасов материальных оборотных средств в форме готовых продуктов, держателями которых являются производители активов. Аналогичным образом, импортированный продукт не отражается в счетах как валовое накопление основного капитала, пока он не приобретен единицей, которая имеет в виду использовать его.
source: Система национальных счетов 2008
  source: https://stat.semanticpro.org/xwiki/wiki/NationalAccounts/view/%D0%91%D0%B8%D0%B1%D0%BB%D0%B8%D0%BE%D1%82%D0%B5%D0%BA%D0%B0/%D0%A1%D0%B8%D1%81%D1%82%D0%B5%D0%BC%D0%B0%20%D0%BD%D0%B0%D1%86%D0%B8%D0%BE%D…
term status: draft
preferred label: Gross Fixed Capital Formation in a Particular Category of Fixed Asset
broader: Валовое накопление основного капитала
definition: Gross fixed capital formation in a particular category of fixed asset consists of the value of producers’ acquisitions of new and existing products of this type less the value of their disposals of fixed assets of the same type.
definition: Валовое накопление основного капитала в форме конкретной категории основных фондов включает стоимость приобретения производителями новых и существующих объектов этого типа за вычетом стоимости выбытия объектов основных фондов того же самого типа.
in scheme: Глоссарий
related: Материальные оборотные средства
related: Продукты
related: Запасы
related: Актив
related: Производство
top concept of: Глоссарий

Дивиденды
type: Concept
comment: По аналогии с корпорациями, которые определяются в СНС как совокупность институциональных единиц, занимающихся производством (и могут называться по-разному — частные или государственные корпорации, частные или государственные компании, кооперативы, товарищества с ограниченной ответственностью и т. п.), дивиденды должны также определяться как охватывающие любые распределения прибыли корпораций их акционерам или собственникам, как бы они ни назывались. Иногда дивиденды могут распределяться посредством выпуска акций, кроме выпуска бонусных акций, представляющих собой перераспределение между собственными средствами, резервами и нераспределенной прибылью.
source: Система национальных счетов 2008
  source: https://stat.semanticpro.org/xwiki/wiki/NationalAccounts/view/%D0%91%D0%B8%D0%B1%D0%BB%D0%B8%D0%BE%D1%82%D0%B5%D0%BA%D0%B0/%D0%A1%D0%B8%D1%81%D1%82%D0%B5%D0%BC%D0%B0%20%D0%BD%D0%B0%D1%86%D0%B8%D0%BE%D…
requires: Инвестиционный доход
requires: Корпорация
term status: draft
definition: Дивиденды — это форма инвестиционного дохода, на получение которого держатели акций имеют право в результате предоставления средств в распоряжение корпораций.
definition: Dividends are a form of investment income to which shareholders become entitled as a result of placing funds at the disposal of corporations.
in scheme: Глоссарий
preferred label: Dividends
related: Институциональная единица
related: Корпорация
related: Выпуск
related: Производство
top concept of: Глоссарий

Продукты
type: Concept
source: Система национальных счетов 2008
  source: https://stat.semanticpro.org/xwiki/wiki/NationalAccounts/view/%D0%91%D0%B8%D0%B1%D0%BB%D0%B8%D0%BE%D1%82%D0%B5%D0%BA%D0%B0/%D0%A1%D0%B8%D1%81%D1%82%D0%B5%D0%BC%D0%B0%20%D0%BD%D0%B0%D1%86%D0%B8%D0%BE%D…
requires: Запасы
requires: Товары
requires: Услуги
requires: Производство
term status: draft
alternative label: Продукция
definition: Products are goods and services (including knowledge-capturing products) that result from a process of production.
definition: Продукты — это товары и услуги (включая продукты, содержащие запас знаний), которые являются результатом производства.
in scheme: Глоссарий
preferred label: Products
top concept of: Глоссарий

Рабочая сила
type: Concept
comment: The labour force is further divided into those who are employed and those who are unemployed. Thus the population of the country can be subdivided into three categories; employed, unemployed and not in the labour force. A person’s status depends on their activity (or lack of it) during a particular reference period (usually a week).
comment: Рабочая сила далее подразделяется на занятых лиц и безработных. Таким образом, население страны может быть разделено на три категории: занятые лица, безработные лица и лица, не относящиеся к рабочей силе. Статус лиц зависит от их деятельности (или ее отсутствия) в течение определенного периода (обычно недели).
source: Система национальных счетов 2008
  source: https://stat.semanticpro.org/xwiki/wiki/NationalAccounts/view/%D0%91%D0%B8%D0%B1%D0%BB%D0%B8%D0%BE%D1%82%D0%B5%D0%BA%D0%B0/%D0%A1%D0%B8%D1%81%D1%82%D0%B5%D0%BC%D0%B0%20%D0%BD%D0%B0%D1%86%D0%B8%D0%BE%D…
requires: Товары
requires: Производство
requires: Услуги
term status: draft
definition: Рабочая сила включает лиц, которые реально готовы предоставить свой труд в течение определенного периода для производства товаров и услуг, включенного в границы производства в СНС.
definition: The labour force consists of those who are actively prepared to make their labour available during any particular reference period for producing goods and services that are included within the production boundary of the SNA.
in scheme: Глоссарий
preferred label: Labour Force
related: Занятые лица
related: Население
top concept of: Глоссарий

Нежилые здания
type: Concept
source: Система национальных счетов 2008
  source: https://stat.semanticpro.org/xwiki/wiki/NationalAccounts/view/%D0%91%D0%B8%D0%B1%D0%BB%D0%B8%D0%BE%D1%82%D0%B5%D0%BA%D0%B0/%D0%A1%D0%B8%D1%81%D1%82%D0%B5%D0%BC%D0%B0%20%D0%BD%D0%B0%D1%86%D0%B8%D0%BE%D…
term status: draft
broader: Другие здания и сооружения
definition: Нежилые здания включают все здания или части зданий, не предназначенные для использования в качестве жилых помещений. Включаются арматура, устройства и оборудование, которые являются неотъемлемой частью сооружений.
definition: Buildings other than dwellings include whole buildings or parts of buildings not designated as dwellings. Fixtures, facilities and equipment that are integral parts of the structures are included.
example: Строительство и инвестиции в основной капитал: Предназначение нежилых зданий – создание условий для труда, социально-культурного обслуживания населения и хранения материальных ценностей. Включаются арматура, устройства и оборудование, которые являются неотъемлемой частью сооружений.
in scheme: Глоссарий
preferred label: Buildings other than Dwellings
top concept of: Глоссарий

Остальной мир
type: Concept
comment: Он не является сектором, для которого должен составляться полный набор счетов, хотя часто удобно описать остальной мир, как если бы он был сектором. Счета или таблицы для остального мира содержат записи только об операциях между резидентами и нерезидентами или о других экономических отношениях, таких как требования резидентов к нерезидентам и наоборот. Остальной мир включает некоторые институциональные единицы, которые, возможно, физически расположены на географической территории данной страны; например, такие иностранные анклавы, как посольства, консульства или военные базы, а также международные организации.
requires: Институциональная единица
requires: Операция
term status: draft
definition: The rest of the world consists of all non-resident institutional units that enter into transactions with resident units, or have other economic links with resident units.
definition: Остальной мир охватывает все нерезидентские институциональные единицы, которые участвуют в операциях с резидентскими единицами или имеют другие экономические связи с резидентскими единицами данной страны.
in scheme: Глоссарий
preferred label: Rest of the world
related: Институциональная единица
related: Операция
top concept of: Глоссарий

Выпуск
type: Concept
comment: Выпуск большей части товаров и услуг обычно регистрируется, когда их производство завершено. Однако, когда требуется длительное время для производства единицы выпуска, тогда необходимо признать, что выпуск производится непрерывно, и необходимо отражать незавершенное производство.
source: Система национальных счетов 2008
  source: https://stat.semanticpro.org/xwiki/wiki/NationalAccounts/view/%D0%91%D0%B8%D0%B1%D0%BB%D0%B8%D0%BE%D1%82%D0%B5%D0%BA%D0%B0/%D0%A1%D0%B8%D1%81%D1%82%D0%B5%D0%BC%D0%B0%20%D0%BD%D0%B0%D1%86%D0%B8%D0%BE%D…
requires: Заведение
requires: Продукты
requires: Материальные оборотные средства
requires: Товары
requires: Запасы
requires: Услуги
requires: Производство
term status: draft
broader: Производство
definition: Output is defined as the goods and services produced by an establishment, excluding the value of any goods and services used in an activity for which the establishment does not assume the risk of using the products in production, and excluding the value of goods and services consumed by the same establishment except for goods and services used for capital formation (fixed capital or changes in inventories) or own final consumption.
definition: Выпуск определяется как стоимость товаров и услуг, произведенных заведением, исключая стоимость любых товаров и услуг, использованных в деятельности, в отношении которых заведение не принимает риск, связанный с использованием продуктов в производстве, и исключая стоимость товаров и услуг, потребленных тем же самым заведением, за исключением товаров и услуг, использованных для накопления (основного капитала или запасов материальных оборотных средств) или для собственного конечного потребления.
in scheme: Глоссарий
preferred label: Output
related: Товары
related: Незавершенное производство
related: Производство
related: Услуги
top concept of: Глоссарий

Занятость в пересчете на эквивалент полной занятости
type: Concept
comment: Занятость в пересчете на эквивалент полной занятости определяется на основе числа отработанных часов в среднем на работе с полной занятостью. Если число часов работы с полной занятостью снижается, например, из-за увеличения продолжительности ежегодного отпуска или государственных праздников, то показатели занятости в пересчете на эквивалент полной занятости могут измениться мало или совсем не измениться, даже если общее число фактически отработанных часов снизилось. Подобный эффект может быть вызван увеличением продолжительности отпусков по болезни. Поэтому оценка числа часов работы с полной занятостью корректируется на среднюю величину отпусков по болезни, взятых как в базисном периоде, так и в отчетном году.
source: Система национальных счетов 2008
  source: https://stat.semanticpro.org/xwiki/wiki/NationalAccounts/view/%D0%91%D0%B8%D0%B1%D0%BB%D0%B8%D0%BE%D1%82%D0%B5%D0%BA%D0%B0/%D0%A1%D0%B8%D1%81%D1%82%D0%B5%D0%BC%D0%B0%20%D0%BD%D0%B0%D1%86%D0%B8%D0%BE%D…
requires: Занятые лица
term status: draft
definition: Занятость в пересчете на эквивалент полной занятости — это число работ в условиях полной занятости, которое определяется как общее число фактически отработанных часов всеми занятыми лицами, деленное на среднее число часов, фактически отработанных на работах с полной занятостью.
definition: Full-time equivalent employment is the number of full-time equivalent jobs, defined as total hours actually worked by all employed persons divided by the average number of hours actually worked in full-time jobs.
in scheme: Глоссарий
preferred label: Full-time equivalent employment
top concept of: Глоссарий

Индекс объема
type: Concept
comment: Количества, сравниваемые за периоды времени, должны относиться к однородным продуктам, и исчисляемые индексы изменений количеств различных товаров и услуг должны быть взвешенными по их экономической значимости, определенной их относительными объемами в одном, другом или в обоих периодах. По этой причине объем является более правильным и адекватным термином, чем количество, поскольку важно иметь в виду, что количества должны быть скорректированы, чтобы отразить изменения качества товаров и услуг.
source: Система национальных счетов 2008
  source: https://stat.semanticpro.org/xwiki/wiki/NationalAccounts/view/%D0%91%D0%B8%D0%B1%D0%BB%D0%B8%D0%BE%D1%82%D0%B5%D0%BA%D0%B0/%D0%A1%D0%B8%D1%81%D1%82%D0%B5%D0%BC%D0%B0%20%D0%BD%D0%B0%D1%86%D0%B8%D0%BE%D…
requires: Товары
requires: Услуги
term status: draft
definition: Индекс объема — это средняя величина изменений количеств определенного набора товаров или услуг между двумя периодами времени.
definition: A volume index is an average of the proportionate changes in the quantities of a specified set of goods or services between two periods of time.
in scheme: Глоссарий
preferred label: Volume Index
related: Продукты
related: Товары
related: Услуги
top concept of: Глоссарий

Договор финансового лизинга
type: Concept
comment: Часто бывает, что арендодатель, хотя и является юридическим собственником актива, никогда не занимается физически доставкой актива, но дает согласие на его доставку непосредственно арендополучателю. Один из признаков финансового лизинга состоит в том, что необходимый ремонт и техническое обслуживание актива обеспечивается экономическим собственником. При финансовом лизинге юридический собственник выступает как предоставляющий ссуду арендополучателю, который на эти средства приобретает актив. Поэтому актив показывается в балансе активов и пассивов арендополучателя, а не арендодателя; соответствующая ссуда показывается как актив арендодателя и обязательство арендополучателя. Платежи при финансовом лизинге рассматриваются не как арендная плата, а как выплаты процентов и погашение основного долга. Если арендодателем является финансовое учреждение, то часть платежей трактуется также как плата за услуги (УФПИК).
source: Система национальных счетов 2008
  source: https://stat.semanticpro.org/xwiki/wiki/NationalAccounts/view/%D0%91%D0%B8%D0%B1%D0%BB%D0%B8%D0%BE%D1%82%D0%B5%D0%BA%D0%B0/%D0%A1%D0%B8%D1%81%D1%82%D0%B5%D0%BC%D0%B0%20%D0%BD%D0%B0%D1%86%D0%B8%D0%BE%D…
requires: Юридический собственник
requires: Актив
requires: Производство
term status: draft
alternative label: Lease - Financial
definition: Договор финансового лизинга — это договор аренды, в соответствии с которым арендодатель как юридический собственник актива передает его в экономическую собственность арендополучателю, который принимает на себя операционные риски и получает экономические выгоды от использования актива в производственной деятельности.
definition: A financial lease is one where the lessor as legal owner of an asset passes the economic ownership to the lessee who then accepts the operating risks and receives the economic benefits from using the asset in a productive activity.
in scheme: Глоссарий
preferred label: Financial Lease
related: Экономический собственник
related: Баланс активов и пассивов
related: Арендная плата
related: Юридический собственник
related: Процент
related: Обязательство
related: Актив
related: Услуги
related: Ссуды
top concept of: Глоссарий

Материальные оборотные средства военного назначения
type: Concept
comment: При обсуждении систем вооружения как элемента основного капитала, большинство объектов одноразового использования в военных целях отражаются в счетах как материальные оборотные средства, но некоторые типы ракет с очень высокой разрушительной способностью можно рассматривать как основной капитал вследствие их способности оказывать длительную услугу по сдерживанию агрессоров.
source: Система национальных счетов 2008
  source: https://stat.semanticpro.org/xwiki/wiki/NationalAccounts/view/%D0%91%D0%B8%D0%B1%D0%BB%D0%B8%D0%BE%D1%82%D0%B5%D0%BA%D0%B0/%D0%A1%D0%B8%D1%81%D1%82%D0%B5%D0%BC%D0%B0%20%D0%BD%D0%B0%D1%86%D0%B8%D0%BE%D…
requires: Системы вооружения
term status: draft
broader: Материальные оборотные средства
definition: Материальные оборотные средства военного назначения состоят из объектов одноразового использования, таких как боеприпасы, снаряды, ракеты, бомбы и т. д., доставляемые оружием или системами вооружения.
definition: Military inventories consist of single-use items, such as ammunition, missiles, rockets, bombs, etc., delivered by weapons or weapons systems.
in scheme: Глоссарий
preferred label: Military Inventories
related: Системы вооружения
related: Материальные оборотные средства
related: Услуги
top concept of: Глоссарий

ВВП, исчисленный распределительным методом
type: Concept
comment: Добавленную стоимость можно рассматривать как сумму элементов, составляющих доход: оплата труда, прибыль, смешанный доход и другие налоги на производство за вычетом других субсидий на производство. Если имеются отдельные оценки этих компонентов, то возможен распределительный метод исчисления ВВП. Поскольку другие налоги на производство за вычетом других субсидий на производство включены в добавленную стоимость, и налоги на продукты за вычетом субсидий на продукты также должны быть включены в ВВП, две статьи этих налогов могут быть заменены показателем, являющимся их суммой — налоги на производство и импорт за вычетом субсидий на производство и импорт.
source: Система национальных счетов 2008
  source: https://stat.semanticpro.org/xwiki/wiki/NationalAccounts/view/%D0%91%D0%B8%D0%B1%D0%BB%D0%B8%D0%BE%D1%82%D0%B5%D0%BA%D0%B0/%D0%A1%D0%B8%D1%81%D1%82%D0%B5%D0%BC%D0%B0%20%D0%BD%D0%B0%D1%86%D0%B8%D0%BE%D…
requires: Оплата труда
requires: Налоги
requires: Субсидии
requires: Производство
term status: draft
alternative label: Валовой внутренний продукт распределительным методом
broader: Валовый внутренний продукт
definition: The income measure of gross domestic product (GDP) is derived as compensation of employees plus gross operating surplus plus gross mixed incomes plus taxes less subsidies on both production and imports.
definition: Оценка валового внутреннего продукта (ВВП) распределительным методом получается как оплата труда, плюс валовая прибыль, плюс валовой смешанный доход, плюс налоги на производство и импорт за вычетом субсидий.
in scheme: Глоссарий
preferred label: Income Measure of Gross Domestic Product
related: Другие субсидии на производство
related: Оплата труда
related: Налоги
related: Субсидия на продукт
related: Субсидии
related: Валовый внутренний продукт
related: Налог на продукт
related: Производство
top concept of: Глоссарий

Экономика в целом
type: Concept
comment: Резидентские институциональные единицы, которые в совокупности составляют экономику страны, группируются в пять взаимно исключающих друг друга институциональных секторов. Секторы — это группы институциональных единиц, и каждая институциональная единица в целом должна быть отнесена к одному или другому сектору. Полная последовательность счетов СНС может быть составлена для одной институциональной единицы или группы единиц. Характеристики институциональной единицы поясняют, почему невозможно составить полную последовательность счетов для какой-либо части единицы. Однако возможно и целесообразно составлять некоторые счета для некоторых разновидностей корпораций, различающихся по типам производства, которые они осуществляют.
source: Система национальных счетов 2008
  source: https://stat.semanticpro.org/xwiki/wiki/NationalAccounts/view/%D0%91%D0%B8%D0%B1%D0%BB%D0%B8%D0%BE%D1%82%D0%B5%D0%BA%D0%B0/%D0%A1%D0%B8%D1%81%D1%82%D0%B5%D0%BC%D0%B0%20%D0%BD%D0%B0%D1%86%D0%B8%D0%BE%D…
requires: Институциональная единица
requires: Резидентство
term status: draft
definition: The total economy is defined as the entire set of resident institutional units.
definition: Экономика страны в целом определена как общая совокупность резидентских институциональных единиц.
in scheme: Глоссарий
preferred label: Total Economy
related: Институциональный сектор
related: Институциональная единица
related: Корпорация
related: Производство
top concept of: Глоссарий

Домашнее хозяйство
type: Concept
comment: Отдельные члены домашнего хозяйства, которое состоит из нескольких лиц, не рассматриваются как отдельные институциональные единицы. Многие активы являются собственностью двух или более членов того же самого домашнего хозяйства, и обязательства также могут приниматься несколькими членами того же самого домашнего хозяйства; в то же время доход, полученный отдельными членами того же домашнего хозяйства, может быть использован всеми членами домашнего хозяйства. Более того, многие решения по вопросу о расходах, в особенности те, которые относятся к расходам на продукты питания и оплату жилищных услуг, могут приниматься коллективно для домашнего хозяйства в целом. Поэтому может оказаться невозможным составить баланс активов и пассивов и другие счета для отдельных членов домашнего хозяйства, которые содержали бы полезную с экономической точки зрения информацию. По этой причине домашнее хозяйство в целом, а не отдельные его члены, должно рассматриваться как институциональная единица
source: Система национальных счетов 2008
  source: https://stat.semanticpro.org/xwiki/wiki/NationalAccounts/view/%D0%91%D0%B8%D0%B1%D0%BB%D0%B8%D0%BE%D1%82%D0%B5%D0%BA%D0%B0/%D0%A1%D0%B8%D1%81%D1%82%D0%B5%D0%BC%D0%B0%20%D0%BD%D0%B0%D1%86%D0%B8%D0%BE%D…
requires: Продукты
requires: Товары
requires: Услуги
term status: draft
alternative label: Домохозяйство
broader: Институциональный сектор
definition: Household is a group of persons who share the same living accommodation, who pool some, or all, of their income and wealth and who consume certain types of goods and services collectively, mainly housing and food.
definition: Домашнее хозяйство определено как группа лиц, которые живут в одном и том же жилище, объединяют частично или полностью свои доходы и имущество и потребляют коллективно некоторые виды товаров и услуг, главным образом, жилищные услуги и продукты питания.
example: Уровень и условия жизни: Рассматривает совокупность лиц, проживающих в одном жилом помещении (или его части), как связанных, так и не связанных отношениями родства. Домохозяйство может состоять и из одного человека, живущего самостоятельно и обеспечивающего себя пищей и всем необходимым для жизни.
in scheme: Глоссарий
preferred label: Household
related: Баланс активов и пассивов
related: Продукты
related: Институциональная единица
related: Обязательство
related: Актив
related: Услуги
top concept of: Глоссарий

Индексируемые ценные бумаги
type: Concept
comment: Цель состоит в том, чтобы сохранить покупательную способность или стоимость капитала в период инфляции в дополнение к получению дохода в виде процентов. Когда индексируются платежи по купонам, то они рассматриваются исключительно как проценты, как и в случае любого финансового актива с плавающей процентной ставкой. Когда основная сумма индексируется с помощью показателя инфляции, исчисленного на широкой основе, то стоимость ценных бумаг по цене эмиссии отражается как основная сумма, а суммы индексации, выплачиваемые периодически и при погашении, отражаются как проценты. Выплаты вследствие индексации должны отражаться как проценты (доходы от собственности) на протяжении времени существования ценных бумаг, и корреспондирующие записи должны отражаться в категории долговых ценных бумаг в финансовом счете. Когда ценные бумаги индексируются с помощью индексов цен на какой-либо товар и, таким образом, могут быть подвержены значительным колебаниям цен, рекомендуется изменить данную процедуру.
source: Система национальных счетов 2008
  source: https://stat.semanticpro.org/xwiki/wiki/NationalAccounts/view/%D0%91%D0%B8%D0%B1%D0%BB%D0%B8%D0%BE%D1%82%D0%B5%D0%BA%D0%B0/%D0%A1%D0%B8%D1%81%D1%82%D0%B5%D0%BC%D0%B0%20%D0%BD%D0%B0%D1%86%D0%B8%D0%BE%D…
requires: Цена
requires: Товары
requires: Процент
term status: draft
definition: Index-linked securities are instruments for which either the coupon payments (interest) or the principal or both are linked to an index such as a price index or the price of a commodity.
definition: Индексируемые ценные бумаги — это инструменты, для которых либо платежи по купонам (проценты), либо основная сумма, либо и то, и другое привязаны к какому-либо индексу, такому как общий индекс цен или индекс цен какого-либо товара.
in scheme: Глоссарий
preferred label: Index-Linked Securities
related: Долговые ценные бумаги
related: Цена
related: Товары
related: Ценные бумаги
related: Процент
related: Актив
related: Доход от собственности
top concept of: Глоссарий

Актив
type: Concept
comment: Активы могут быть финансовыми и нефинансовыми. Для большинства финансовых активов существуют корреспондирующие (финансовые) обязательства.
source: Система национальных счетов 2008
  source: https://stat.semanticpro.org/xwiki/wiki/NationalAccounts/view/%D0%91%D0%B8%D0%B1%D0%BB%D0%B8%D0%BE%D1%82%D0%B5%D0%BA%D0%B0/%D0%A1%D0%B8%D1%81%D1%82%D0%B5%D0%BC%D0%B0%20%D0%BD%D0%B0%D1%86%D0%B8%D0%BE%D…
requires: Экономический собственник
requires: Запасы
term status: draft
definition: An asset is a store of value representing a benefit or series of benefits accruing to the economic owner by holding or using the entity over a period of time. It is a means of carrying forward value from one accounting period to another.
definition: Актив — это накопленный запас стоимости, приносящий экономическую выгоду или ряд экономических выгод экономическому собственнику актива как следствие владения им или использования его в течение некоторого периода времени. Это средство, позволяющее переносить стоимость от одного отчетного периода к другому.
in scheme: Глоссарий
preferred label: Asset
related: Финансовые активы
related: Обязательство
top concept of: Глоссарий

Другие виды участия в капитале
type: Concept
comment: Они могут включать участие в капитале квазикорпораций (таких как отделения, трасты, партнерства с ограниченной ответственностью и другие партнерства), неинкорпорированных фондов и условных единиц, создаваемых для отражения прав собственности на недвижимое имущество и природные ресурсы. Собственность некоторых международных организаций не регистрируется в форме акций и классифицируется поэтому как другие виды участия в капитале (хотя участие в капитале Банка для международных расчетов (БМР) осуществляется в форме акций, не включенных в листинг).
source: Система национальных счетов 2008
  source: https://stat.semanticpro.org/xwiki/wiki/NationalAccounts/view/%D0%91%D0%B8%D0%B1%D0%BB%D0%B8%D0%BE%D1%82%D0%B5%D0%BA%D0%B0/%D0%A1%D0%B8%D1%81%D1%82%D0%B5%D0%BC%D0%B0%20%D0%BD%D0%B0%D1%86%D0%B8%D0%BE%D…
requires: Ценные бумаги
term status: draft
definition: Другие виды участия в капитале — это участие в капитале, не выраженное в форме ценных бумаг.
definition: Other equity is equity that is not in the form of securities.
in scheme: Глоссарий
preferred label: Other Equity
related: Акции, не включенные в листинг
related: Квазикорпорация
related: Природные ресурсы
top concept of: Глоссарий

ВВП, исчисленный методом конечного использования
type: Concept
source: Система национальных счетов 2008
  source: https://stat.semanticpro.org/xwiki/wiki/NationalAccounts/view/%D0%91%D0%B8%D0%B1%D0%BB%D0%B8%D0%BE%D1%82%D0%B5%D0%BA%D0%B0/%D0%A1%D0%B8%D1%81%D1%82%D0%B5%D0%BC%D0%B0%20%D0%BD%D0%B0%D1%86%D0%B8%D0%BE%D…
requires: Расходы на конечное потребление
requires: Валовое накопление
term status: draft
alternative label: GDP Expenditure Measure
alternative label: Валовой внутренний продукт методом конечного использования
broader: Валовый внутренний продукт
definition: Оценка валового внутреннего продукта (ВВП) методом конечного использования получается как сумма расходов на конечное потребление, плюс валовое накопление, плюс экспорт, минус импорт.
definition: The expenditure measure of gross domestic product (GDP) is derived as the sum of expenditure on final consumption plus gross capital formation plus exports less imports.
in scheme: Глоссарий
preferred label: Expenditure Measure of GDP
top concept of: Глоссарий

Чистые страховые премии (кроме премий по страхованию жизни)
type: Concept
comment: Метод, с помощью которого исчисляется оплата услуг. После вычета оплаты услуг из суммы страховых премий (кроме премий по страхованию жизни) и дополнений к премиям, оставшаяся часть носит название чистых страховых премий (кроме премий по страхованию жизни). Только чистые страховые премии (кроме премий по страхованию жизни) представляют собой текущие трансферты и отражаются в счете вторичного распределения доходов. Оплата услуг рассматривается как приобретение услуг держателями полисов и отражается как промежуточное потребление или конечное потребление в зависимости от типа держателя полиса.
comment: The way in which the service charges are calculated. After deducting the service charges from the sum of non-life insurance premiums and premium supplements, the remainder is described as net non-life insurance premiums. Only the net non-life insurance premiums constitute current transfers and are recorded in the secondary distribution of income account. The service charges constitute purchases of services by the policyholders and are recorded as intermediate or final consumption, as appropriate.
source: Система национальных счетов 2008
  source: https://stat.semanticpro.org/xwiki/wiki/NationalAccounts/view/%D0%91%D0%B8%D0%B1%D0%BB%D0%B8%D0%BE%D1%82%D0%B5%D0%BA%D0%B0/%D0%A1%D0%B8%D1%81%D1%82%D0%B5%D0%BC%D0%B0%20%D0%BD%D0%B0%D1%86%D0%B8%D0%BE%D…
requires: Инвестиционный доход
requires: Страховые корпорации
requires: Услуги
term status: draft
definition: Чистые страховые премии (кроме премий по страхованию жизни) включают как фактические премии, подлежащие выплате держателями полисов для получения страхового покрытия в течение отчетного периода (заработанные премии), так и дополнения к премиям, подлежащие выплате из инвестиционного дохода, вмененного держателям полисов, за вычетом оплаты услуг страховой корпорации.
definition: Net non-life insurance premiums comprise both the actual premiums payable by policyholders to obtain insurance cover during the accounting period (premiums earned) and the premium supplements payable out of the investment income attributed to insurance policyholders less the service charges payable to the insurance corporation.
in scheme: Глоссарий
preferred label: Net Non-Life Insurance Premiums
related: Промежуточное потребление
related: Текущий трансферт
related: Потребление
related: Страхование жизни
related: Услуги
top concept of: Глоссарий

Существующий объект основных фондов
type: Concept
source: Система национальных счетов 2008
  source: https://stat.semanticpro.org/xwiki/wiki/NationalAccounts/view/%D0%91%D0%B8%D0%B1%D0%BB%D0%B8%D0%BE%D1%82%D0%B5%D0%BA%D0%B0/%D0%A1%D0%B8%D1%81%D1%82%D0%B5%D0%BC%D0%B0%20%D0%BD%D0%B0%D1%86%D0%B8%D0%BE%D…
requires: Запасы
term status: draft
definition: Существующий объект основных фондов — это такой объект, стоимость которого уже была включена в запас основного капитала, по крайней мере, одного производителя в отечественной экономике в некоторый предыдущий момент времени независимо от того, произошло ли это в текущем или в предшествующем отчетном периоде.
definition: An existing fixed asset is one whose value was included in the stock of fixed capital of at least one producer unit in the domestic economy at some earlier point in time either in the current period or in the immediately previous accounting period.
in scheme: Глоссарий
preferred label: Existing Fixed Asset
top concept of: Глоссарий

Форвардный валютный контракт
type: Concept
comment: Расчеты по фьючерсам и другим форвардным контрактам обычно, но не всегда, осуществляются выплатой наличных денег или предоставлением некоторого другого финансового инструмента, а не фактической поставкой лежащего в основе контракта объекта, и поэтому эти контракты оцениваются и обращаются отдельно от лежащего в основе контракта объекта.
source: Система национальных счетов 2008
  source: https://stat.semanticpro.org/xwiki/wiki/NationalAccounts/view/%D0%91%D0%B8%D0%B1%D0%BB%D0%B8%D0%BE%D1%82%D0%B5%D0%BA%D0%B0/%D0%A1%D0%B8%D1%81%D1%82%D0%B5%D0%BC%D0%B0%20%D0%BD%D0%B0%D1%86%D0%B8%D0%BE%D…
term status: draft
definition: A forward contract is an unconditional financial contract that represents an obligation for settlement on a specified date. Futures and other forward contracts are typically, but not always, settled by the payment of cash or the provision of some other financial instrument rather than the actual delivery of the underlying item and therefore are valued and traded separately from the underlying item.
definition: Форвардный валютный контракт — это контракт, в соответствии с которым две стороны соглашаются обменять определенные суммы в разных иностранных валютах по согласованному обменному курсу в определенную дату в будущем.
in scheme: Глоссарий
preferred label: Forward Contract
related: Форвардный контракт
top concept of: Глоссарий

Вторичная деятельность
type: Concept
comment: Величина добавленной стоимости, созданная в процессе вторичной деятельности, должна быть меньше добавленной стоимости основной деятельности. Выпуск, произведенный в результате вторичной деятельности, называется вторичным продуктом. Большинство производственных единиц выпускают, по крайней мере, некоторые вторичные продукты.
source: Система национальных счетов 2008
  source: https://stat.semanticpro.org/xwiki/wiki/NationalAccounts/view/%D0%91%D0%B8%D0%B1%D0%BB%D0%B8%D0%BE%D1%82%D0%B5%D0%BA%D0%B0/%D0%A1%D0%B8%D1%81%D1%82%D0%B5%D0%BC%D0%B0%20%D0%BD%D0%B0%D1%86%D0%B8%D0%BE%D…
requires: Основная деятельность
requires: Выпуск
term status: draft
broader: Производство
definition: Вторичная деятельность — это деятельность, осуществляемая внутри производственной единицы наряду с основной деятельностью, и чей выпуск, подобно выпуску основной деятельности, должен быть пригоден для поставки за пределы этой производственной единицы.
definition: A secondary activity is an activity carried out within a single producer unit in addition to the principal activity and whose output, like that of the principal activity, must be suitable for delivery outside the producer unit.
in scheme: Глоссарий
preferred label: Secondary Activity
related: Продукты
related: Выпуск
top concept of: Глоссарий

Программа социального страхования
type: Concept
source: Система национальных счетов 2008
  source: https://stat.semanticpro.org/xwiki/wiki/NationalAccounts/view/%D0%91%D0%B8%D0%B1%D0%BB%D0%B8%D0%BE%D1%82%D0%B5%D0%BA%D0%B0/%D0%A1%D0%B8%D1%81%D1%82%D0%B5%D0%BC%D0%B0%20%D0%BD%D0%B0%D1%86%D0%B8%D0%BE%D…
requires: Социальные пособия
term status: draft
definition: A social insurance scheme is an insurance scheme where the following two conditions are satisfied, (a) the benefits received are conditional on participation in the scheme and constitute social benefits as this term is used in the SNA, and (b) at least one of the three conditions following is met. (Ⅰ) Participation in the scheme is obligatory either by law or under the terms and conditions of employment of an employee, or group of employees. (ⅠⅠ) The scheme is a collective one operated for the benefit of a designated group of workers, whether employed or non-employed, participation being restricted to members of that group. (ⅠⅠⅠ) An employer makes a contribution (actual or imputed) to the scheme on behalf of an employee, whether or not the employee also makes a contribution.
definition: Программа социального страхования — это программа страхования, удовлетворяющая двум следующим требованиям: а) получение пособий обусловлено участием в программе, и эти пособия соответствуют социальным пособиям в определении СНС, и b) выполняется, по крайней мере, одно из следующих трех условий: i ) участие в программе носит обязательный характер либо в соответствии с законодательством, либо по условиям найма работника или группы наемных работников; ii) программа действует на коллективной основе в интересах определенной группы работников, как занятых, так и незанятых, причем участие в ней ограничивается только членами этой группы; iii) работодатель производит отчисления (фактические или условно исчисленные) в программу от имени наемного работника независимо от того, производит ли наемный работник также отчисления или нет
in scheme: Глоссарий
preferred label: Social Insurance Scheme
top concept of: Глоссарий

Товар длительного пользования
type: Concept
comment: Потребительский товар длительного пользования — это товар, который может использоваться для целей потребления неоднократно или непрерывно на протяжении одного года или больше. В случае с товарами различие между приобретением и использованием является важным с аналитической точки зрения. Оно особенно важно в случае с различием между товарами длительного пользования и товарами не длительного пользования, которое широко используется в экономическом анализе. В действительности различие между товарами длительного пользования и товарами недлительного пользования не основано на времени физической сохранности как таковой. Вместо этого различие основано на том, могут ли товары использоваться в целях производства или потребления только однажды или они могут использоваться неоднократно или непрерывно. Например, уголь является товаром длительного пользования в физическом смысле, но он может быть сожжен только однажды.
source: Система национальных счетов 2008
  source: https://stat.semanticpro.org/xwiki/wiki/NationalAccounts/view/%D0%91%D0%B8%D0%B1%D0%BB%D0%B8%D0%BE%D1%82%D0%B5%D0%BA%D0%B0/%D0%A1%D0%B8%D1%81%D1%82%D0%B5%D0%BC%D0%B0%20%D0%BD%D0%B0%D1%86%D0%B8%D0%BE%D…
requires: Товары
term status: draft
broader: Товары
definition: Товар длительного пользования — это товар, который может использоваться неоднократно или непрерывно на протяжении одного года или больше с учетом нормальной или средней нормы физического использования.
definition: A durable good is one that may be used repeatedly or continuously over a period of more than a year, assuming a normal or average rate of physical usage. A consumer durable is a good that may be used for purposes of consumption repeatedly or continuously over a period of a year or more.
in scheme: Глоссарий
preferred label: Durable Good
related: Товары
related: Потребление
related: Производство
top concept of: Глоссарий

Банковский акцепт
type: Concept
comment: В отличие от акцептов в более широком смысле, банковский акцепт должен быть обращающимся. Большие объемы международной торговли финансируются именно таким образом. Банковские акцепты классифицируются в категории долговых ценных бумаг. Банковский акцепт представляет собой безусловное требование со стороны держателя и без условное обязательство со стороны акцептующей финансовой корпорации; корреспондирующим активом финансовой корпорации является требование к своему клиенту. Банковские акцепты рассматриваются как финансовые активы с момента акцепта, даже при том, что денежные средства могут быть получены позже.
source: Система национальных счетов 2008
  source: https://stat.semanticpro.org/xwiki/wiki/NationalAccounts/view/%D0%91%D0%B8%D0%B1%D0%BB%D0%B8%D0%BE%D1%82%D0%B5%D0%BA%D0%B0/%D0%A1%D0%B8%D1%81%D1%82%D0%B5%D0%BC%D0%B0%20%D0%BD%D0%B0%D1%86%D0%B8%D0%BE%D…
requires: Финансовые корпорации
requires: Вексель
term status: draft
preferred label: Banker’s Acceptance
definition: A banker’s acceptance involves the acceptance by a financial corporation, in return for a fee, of a draft or bill of exchange and the unconditional promise to pay a specific amount at a specified date.
definition: Банковский акцепт предполагает акцепт финансовой корпорацией векселя или переводного векселя в обмен на оплату комиссии и безусловное обещание выплатить определенную сумму денег на конкретную дату.
in scheme: Глоссарий
related: Долговые ценные бумаги
related: Финансовые корпорации
related: Обязательство
related: Актив
top concept of: Глоссарий

Ресурсы минеральных и энергетических полезных ископаемых
type: Concept
comment: Ownership rights to the mineral and energy resources are usually separable from those to the land itself. Mineral and energy resources consist of known reserves of coal, oil, gas or other fuels and metallic ores, and non-metallic minerals, etc., that are located below or on the earth’s surface, including reserves under the sea.
comment: Права собственности на ресурсы минеральных и энергетических полезных ископаемых обычно отделяются от прав собственности на землю как таковую. Ресурсы минеральных и энергетических полезных ископаемых состоят из известных запасов угля, нефти, газа или других видов топлива и металлических руд, нерудных полезных ископаемых и т. д., которые расположены под поверхностью земли или на ней, включая запасы на дне моря.
source: Система национальных счетов 2008
  source: https://stat.semanticpro.org/xwiki/wiki/NationalAccounts/view/%D0%91%D0%B8%D0%B1%D0%BB%D0%B8%D0%BE%D1%82%D0%B5%D0%BA%D0%B0/%D0%A1%D0%B8%D1%81%D1%82%D0%B5%D0%BC%D0%B0%20%D0%BD%D0%B0%D1%86%D0%B8%D0%BE%D…
requires: Цена
requires: Запасы
requires: Земля
term status: draft
definition: Mineral and energy resources consist of mineral and energy reserves located on or below the earth’s surface that are economically exploitable, given current technology and relative prices.
definition: Ресурсы минеральных и энергетических полезных ископаемых состоят из запасов минералов и энергоносителей, расположенных на поверхности земли или под землей, которые являются экономически пригодными для использования с учетом существующей технологии и относительных цен.
in scheme: Глоссарий
preferred label: Mineral and Energy Resources
related: Запасы
related: Земля
top concept of: Глоссарий

Монетарное золото
type: Concept
comment: Оно включает золото в слитках (включая золото, размещенное на счетах аллокированного золота) и счета неаллокированного золота у нерезидентов, которые дают право требовать поставки золота. Все монетарное золото включается в резервные активы или держится международными финансовыми организациями. Только золото, которое держится как финансовый актив и как компонент международных резервов, классифицируется как монетарное золото.
source: Система национальных счетов 2008
  source: https://stat.semanticpro.org/xwiki/wiki/NationalAccounts/view/%D0%91%D0%B8%D0%B1%D0%BB%D0%B8%D0%BE%D1%82%D0%B5%D0%BA%D0%B0/%D0%A1%D0%B8%D1%81%D1%82%D0%B5%D0%BC%D0%B0%20%D0%BD%D0%B0%D1%86%D0%B8%D0%BE%D…
requires: Резервные активы
term status: draft
definition: Monetary gold is gold to which the monetary authorities (or others who are subject to the effective control of the monetary authorities) have title and that is held as a reserve asset
definition: Монетарное золото — это золото, которое принадлежит органам денежно-кредитного регулирования (или другим находящимся под их фактическим контролем единицам) и держится ими в качестве резервного актива.
in scheme: Глоссарий
preferred label: Monetary Gold
related: Резервные активы
related: Актив
top concept of: Глоссарий

Заведение
type: Concept
comment: Хотя в определении заведения предусмотрена возможность осуществления одного или нескольких видов вторичной деятельности, ее масштабы должны быть невелики по сравнению с основной. Когда вторичная деятельность внутри предприятия приобретает столь же значительные (или приближенные к ним) размеры, как основная, считается, что она осуществляется в рамках заведения, отдельного от заведения, занятого основной деятельностью. Таким образом, заведения образуют единицы, данные о которых более пригодны для анализа производства, где технология производства играет важную роль.
source: Система национальных счетов 2008
  source: https://stat.semanticpro.org/xwiki/wiki/NationalAccounts/view/%D0%91%D0%B8%D0%B1%D0%BB%D0%B8%D0%BE%D1%82%D0%B5%D0%BA%D0%B0/%D0%A1%D0%B8%D1%81%D1%82%D0%B5%D0%BC%D0%B0%20%D0%BD%D0%B0%D1%86%D0%B8%D0%BE%D…
requires: Предприятие
requires: EconomicActivity
requires: Основная деятельность
term status: draft
broader: Предприятие
definition: Заведение — это предприятие или часть предприятия, которое находится в каком-то одном месте и на котором осуществляется только один вид экономической деятельности или в котором на основной вид деятельности приходится бόльшая (преобладающая) часть добавленной стоимости.
definition: An establishment is an enterprise, or part of an enterprise, that is situated in a single location and in which only a single productive activity is carried out or in which the principal productive activity accounts for most of the value added.
in scheme: Глоссарий
preferred label: Establishment
related: Предприятие
related: Основная деятельность
related: Производство
related: Вторичная деятельность
top concept of: Глоссарий

Варранты
type: Concept
comment: Варранты — это форма опционов, которые отражаются в финансовом счете таким же образом, как другие опционы. Существуют также валютные варранты, в основе которых лежит сумма одной валюты, которая необходима для покупки другой валюты, и варранты валютных кросс-курсов, привязанные к третьим валютам. Они могут продаваться отдельно от лежащих в их основе ценных бумаг, к которым они привязаны, и поэтому имеют рыночную стоимость. Продавец варранта принимает обязательство, которое корреспондирует с активом, имеющимся у покупателя.
source: Система национальных счетов 2008
  source: https://stat.semanticpro.org/xwiki/wiki/NationalAccounts/view/%D0%91%D0%B8%D0%B1%D0%BB%D0%B8%D0%BE%D1%82%D0%B5%D0%BA%D0%B0/%D0%A1%D0%B8%D1%81%D1%82%D0%B5%D0%BC%D0%B0%20%D0%BD%D0%B0%D1%86%D0%B8%D0%BE%D…
requires: Корпорация
term status: draft
definition: Варранты — это финансовые инструменты, обращающиеся на бирже и дающие их держателю право купить у продавца варранта (обычно это корпорация) определенное количество акций или облигаций на оговоренных условиях в течение установленного срока.
definition: Warrants are tradable instruments giving the holder the right to buy, under specified terms for a specified period of time, from the issuer of the warrant (usually a corporation) a certain number of shares or bonds.`
in scheme: Глоссарий
preferred label: Warrants
related: Ценные бумаги
related: Обязательство
related: Актив
related: Опционы
top concept of: Глоссарий

Валовая добавленная стоимость в ценах производителей
type: Concept
comment: As already explained, in the absence of VAT, the total value of the intermediate inputs consumed is the same whether they are valued at producers’ or at purchasers’ prices, in which case this measure of gross value added is the same as one that uses producers’ prices to value both inputs and outputs. It is an economically meaningful measure that is equivalent to the traditional measure of gross value added at market prices. However, in the presence of VAT, the producer’s price excludes invoiced VAT, and it would be inappropriate to describe this measure as being at “market” prices.
comment: Как уже было пояснено, в отсутствие НДС общая стоимость промежуточного потребления будет той же самой, независимо от того, оценено ли оно в ценах покупателей или в ценах производителей; это означает, что величина валовой добавленной стоимости будет той же самой, которая получается, если цены производителей используются для оценки и выпуска, и промежуточного потребления. Это измерение добавленной стоимости имеет четкое экономическое содержание, эквивалентное традиционному измерению добавленной стоимости в рыночных ценах. Однако, когда НДС существует, цены производителей исключают начисленный НДС, и поэтому было бы неправильно описывать этот показатель добавленной стоимости как исчисленный в рыночных ценах.
source: Система национальных счетов 2008
  source: https://stat.semanticpro.org/xwiki/wiki/NationalAccounts/view/%D0%91%D0%B8%D0%B1%D0%BB%D0%B8%D0%BE%D1%82%D0%B5%D0%BA%D0%B0/%D0%A1%D0%B8%D1%81%D1%82%D0%B5%D0%BC%D0%B0%20%D0%BD%D0%B0%D1%86%D0%B8%D0%BE%D…
requires: Цена покупателя
requires: Цена производителя
requires: Промежуточное потребление
requires: Выпуск
term status: draft
definition: Gross value added at producers’ prices is defined as output valued at producers’ prices less intermediate consumption valued at purchasers’ prices.
definition: Валовая добавленная стоимость в ценах производителей определяется как выпуск, оцененный в ценах производителей, минус промежуточное потребление, оцененное в ценах покупателей.
in scheme: Глоссарий
preferred label: Gross Value Added at Producers’ Prices
related: Налог на добавленную стоимость
related: Цена
related: Цена покупателя
related: Цена производителя
related: Промежуточное потребление
related: Начисленный НДС
related: Выпуск
top concept of: Глоссарий

Обращающиеся договоры операционного лизинга
type: Concept
source: Система национальных счетов 2008
  source: https://stat.semanticpro.org/xwiki/wiki/NationalAccounts/view/%D0%91%D0%B8%D0%B1%D0%BB%D0%B8%D0%BE%D1%82%D0%B5%D0%BA%D0%B0/%D0%A1%D0%B8%D1%81%D1%82%D0%B5%D0%BC%D0%B0%20%D0%BD%D0%B0%D1%86%D0%B8%D0%BE%D…
requires: Основные фонды
term status: draft
definition: Обращающиеся договоры операционного лизинга — это права собственности третьей стороны, относящиеся к основным фондам.
definition: Marketable operating leases are third-party property rights relating to fixed assets.
in scheme: Глоссарий
preferred label: Marketable Operating Leases
top concept of: Глоссарий

Реорганизация долга
type: Concept
source: Система национальных счетов 2008
  source: https://stat.semanticpro.org/xwiki/wiki/NationalAccounts/view/%D0%91%D0%B8%D0%B1%D0%BB%D0%B8%D0%BE%D1%82%D0%B5%D0%BA%D0%B0/%D0%A1%D0%B8%D1%81%D1%82%D0%B5%D0%BC%D0%B0%20%D0%BD%D0%B0%D1%86%D0%B8%D0%BE%D…
term status: draft
definition: Реорганизация долга (также называемая реструктуризацией долга) определяется как соглашение между кредитором и дебитором (а иногда и с третьей стороной), которое изменяет условия, установленные для обслуживания существующего долга.
definition: Debt reorganization (also referred as debt restructuring) is defined as arrangements involving both the creditor and the debtor (and sometimes third parties) that alter the terms established for servicing an existing debt.
in scheme: Глоссарий
preferred label: Debt Reorganization
top concept of: Глоссарий

Разделенные ценные бумаги
type: Concept
comment: The function of stripping is that investor preferences for particular cash flows can be met in ways different from the mix of cash flows of the original security. Stripped securities may have an issuer different from the original issuer; in which instance, new liabilities are created. There are two cases of stripped securities: a. When a third party acquires the original securities and uses them to back the issue of the stripped securities. Then new funds have been raised and there is a new financial instrument. b. When no new funds are raised and the payments on the original securities are stripped and marketed separately by the issuer or through agents (such as strip dealers) acting with the issuer’s consent.
comment: Функция разделения состоит в том, что предпочтения инвестора в отношении отдельных денежных потоков могут быть удовлетворены различными способами вместо использования смешанных денежных потоков по первоначальным ценным бумагам. У разделенных ценных бумаг может быть эмитент, отличающийся от первоначального эмитента; в этом случае возникают новые обязательства. Имеются два варианта разделенных ценных бумаг: a. когда третья сторона приобретает первоначальные ценные бумаги и использует их, чтобы обеспечить выпуск разделенных ценных бумаг. Тогда мобилизуются новые денежные средства и возникают новые финансовые инструменты; b. когда не мобилизуются новые денежные средства, а платежи по первоначальным ценным бумагам разделяются и продаются отдельно эмитентом или при помощи агентов (таких как дилеры по разделению), действующих с согласия эмитента.
source: Система национальных счетов 2008
  source: https://stat.semanticpro.org/xwiki/wiki/NationalAccounts/view/%D0%91%D0%B8%D0%B1%D0%BB%D0%B8%D0%BE%D1%82%D0%B5%D0%BA%D0%B0/%D0%A1%D0%B8%D1%81%D1%82%D0%B5%D0%BC%D0%B0%20%D0%BD%D0%B0%D1%86%D0%B8%D0%BE%D…
requires: Ценные бумаги
term status: draft
broader: Ценные бумаги
definition: Stripped securities are securities that have been transformed from a principal amount with coupon payments into a series of zero-coupon bonds, with a range of maturities matching the coupon payment date(s) and the redemption date of the principal amount(s).
definition: Разделенные ценные бумаги являются ценными бумагами, которые преобразованы из ценной бумаги с основной суммой и купонными платежами в облигации с нулевым купоном со сроками погашения, совпадающими с датами купонных платежей и датой погашения основной суммы.
in scheme: Глоссарий
preferred label: Stripped Securities
related: Ценные бумаги
related: Выпуск
related: Обязательство
top concept of: Глоссарий

Опцион на приобретение акций работниками
type: Concept
source: Система национальных счетов 2008
  source: https://stat.semanticpro.org/xwiki/wiki/NationalAccounts/view/%D0%91%D0%B8%D0%B1%D0%BB%D0%B8%D0%BE%D1%82%D0%B5%D0%BA%D0%B0/%D0%A1%D0%B8%D1%81%D1%82%D0%B5%D0%BC%D0%B0%20%D0%BD%D0%B0%D1%86%D0%B8%D0%BE%D…
term status: draft
broader: Опционы
definition: An employee stock option is an agreement made on a given date (the “grant” date) under which an employee may purchase a given number of shares of the employer’s stock at a stated price (the “strike” price) either at a stated time (the “vesting” date) or within a period of time (the “exercise” period) immediately following the vesting date.
definition: Опцион на приобретение акций работниками — это соглашение, заключенное на определенную дату (дату гранта), в соответствии с которым работник может приобрести некоторое количество акций работодателя по установленной цене (цене исполнения) или в установленный момент времени (дата передачи) или в течение некоторого периода времени (период использования), который следует немедленно за датой передачи.
in scheme: Глоссарий
preferred label: Employee Stock Option
top concept of: Глоссарий

Местная единица
type: Concept
comment: Такое определение «местной единицы» отражает только один аспект, так как оно не соотносится с видом выполняемой деятельности. Место размещения можно определять по-разному в зависимости от цели: например, в узком смысле — это конкретный адрес, а в более широком — местность в пределах провинции, штата, графства и т.д.
source: Система национальных счетов 2008
  source: https://stat.semanticpro.org/xwiki/wiki/NationalAccounts/view/%D0%91%D0%B8%D0%B1%D0%BB%D0%B8%D0%BE%D1%82%D0%B5%D0%BA%D0%B0/%D0%A1%D0%B8%D1%81%D1%82%D0%B5%D0%BC%D0%B0%20%D0%BD%D0%B0%D1%86%D0%B8%D0%BE%D…
requires: Предприятие
requires: Производство
term status: draft
alternative label: Территориально-обособленное подразделение
broader: Предприятие
definition: A local unit is an enterprise, or a part of an enterprise, that engages in productive activity at or from one location.
definition: Местная единица — это предприятие или часть предприятия, занимающиеся производственной деятельностью в одном месте или из одного места.
in scheme: Глоссарий
preferred label: Local Unit
top concept of: Глоссарий

Расходы на конечное потребление
type: Concept
comment: Расходы на конечное потребление подразделяются на расходы на индивидуальное потребление и расходы на коллективное потребление для обеспечения взаимосвязей, описанных ниже. Однако обычно желательно подразделить расходы на конечное потребление в соответствии с рубриками классификаций расходов по целям или по типам товаров или услуг.
source: Система национальных счетов 2008
  source: https://stat.semanticpro.org/xwiki/wiki/NationalAccounts/view/%D0%91%D0%B8%D0%B1%D0%BB%D0%B8%D0%BE%D1%82%D0%B5%D0%BA%D0%B0/%D0%A1%D0%B8%D1%81%D1%82%D0%B5%D0%BC%D0%B0%20%D0%BD%D0%B0%D1%86%D0%B8%D0%BE%D…
requires: Потребительские товары и услуги
term status: draft
definition: Final consumption expenditure is the amount of expenditure on consumption goods and services.
definition: Расходы на конечное потребление — это сумма расходов на потребительские товары и услуги.
in scheme: Глоссарий
preferred label: Final Consumption Expenditure
related: Товары
related: Потребление
related: Услуги
top concept of: Глоссарий

Приобретение товаров и услуг
type: Concept
comment: Acquisitions are valued at the transaction prices paid by the units that incur the expenditures. In most cases, the transaction price is the market price. The value of the goods or services acquired by an institutional unit or sector consists of the value the goods or services acquired through its expenditure plus the value of goods or services received through social transfers in kind less the value of goods or services paid to other units as social transfers in kind.
comment: Приобретение оценивается в фактических ценах операций, выплаченных единицами, которые осуществляют расходы. В большинстве случаев фактической ценой продажи является рыночная цена. Стоимость товаров или услуг, приобретенных институциональной единицей или сектором, состоит из стоимости товаров или услуг, приобретенных ими путем осуществления расходов, плюс стоимость товаров или услуг, полученных в качестве <a target="_blank" rel="noopener noreferrer" href="https://stat.semanticpro.org/xwiki/wiki/NationalAccounts/view/%D0%93%D0%BB%D0%BE%D1%81%D1%81%D0%B0%D1%80%D0%B8%D0%B8/%D0%A1%D0%BE%D1%86%D0%B8%D0%B0%D0%BB%D1%8C%D0%BD%D1%8B%D0%B5%20%D1%82%D1%80%D0%B0%D0%BD%D1%81%D1%84%D0%B5%D1%80%D1%82%D1%8B%20%D0%B2%20%D0%BD%D0%B0%D1%82%D1%83%D1%80%D0%B0%D0%BB%D1%8C%D0%BD%D0%BE%D0%B9%20%D1%84%D0%BE%D1%80%D0%BC%D0%B5/">социальных трансфертов в натуральной форме, а для некоторых единиц и секторов (таких как органы государственного управления и <a target="_blank" rel="noopener noreferrer" href="https://stat.semanticpro.org/xwiki/wiki/NationalAccounts/view/%D0%93%D0%BB%D0%BE%D1%81%D1%81%D0%B0%D1%80%D0%B8%D0%B8/%D0%9D%D0%B5%D0%BA%D0%BE%D0%BC%D0%BC%D0%B5%D1%80%D1%87%D0%B5%D1%81%D0%BA%D0%B8%D0%B5%20%D0%BE%D1%80%D0%B3%D0%B0%D0%BD%D0%B8%D0%B7%D0%B0%D1%86%D0%B8%D0%B8%2C%20%D0%BE%D0%B1%D1%81%D0%BB%D1%83%D0%B6%D0%B8%D0%B2%D0%B0%D1%8E%D1%89%D0%B8%D0%B5%20%D0%B4%D0%BE%D0%BC%D0%B0%D1%88%D0%BD%D0%B8%D0%B5%20%D1%85%D0%BE%D0%B7%D1%8F%D0%B9%D1%81%D1%82%D0%B2%D0%B0/">НКОДХ) — минус стоимость товаров или услуг, выплаченная другим единицам в качестве <a target="_blank" rel="noopener noreferrer" href="https://stat.semanticpro.org/xwiki/wiki/NationalAccounts/view/%D0%93%D0%BB%D0%BE%D1%81%D1%81%D0%B0%D1%80%D0%B8%D0%B8/%D0%A1%D0%BE%D1%86%D0%B8%D0%B0%D0%BB%D1%8C%D0%BD%D1%8B%D0%B5%20%D1%82%D1%80%D0%B0%D0%BD%D1%81%D1%84%D0%B5%D1%80%D1%82%D1%8B%20%D0%B2%20%D0%BD%D0%B0%D1%82%D1%83%D1%80%D0%B0%D0%BB%D1%8C%D0%BD%D0%BE%D0%B9%20%D1%84%D0%BE%D1%80%D0%BC%D0%B5/">социальных трансфертов в натуральной форме.
source: Система национальных счетов 2008
  source: https://stat.semanticpro.org/xwiki/wiki/NationalAccounts/view/%D0%91%D0%B8%D0%B1%D0%BB%D0%B8%D0%BE%D1%82%D0%B5%D0%BA%D0%B0/%D0%A1%D0%B8%D1%81%D1%82%D0%B5%D0%BC%D0%B0%20%D0%BD%D0%B0%D1%86%D0%B8%D0%BE%D…
requires: Товары
requires: Институциональная единица
requires: Услуги
term status: draft
definition: Приобретение товаров и услуг институциональными единицами происходит, когда они становятся новыми собственниками товаров или когда предоставление им услуг завершено.
definition: Acquisitions of goods and services by institutional units occur when they become the new owners of the goods or when the delivery of services to them is completed.
in scheme: Глоссарий
preferred label: Acquisitions Of Goods And Services
related: Некоммерческие организации, обслуживающие домашние хозяйства
related: Цена
related: Товары
related: Институциональная единица
related: Социальные трансферты в натуральной форме
related: Операция
related: Органы государственного управления
related: Услуги
top concept of: Глоссарий

Валовой национальный доход
type: Concept
comment: Валовой национальный доход (ВНД) определяется как ВВП, плюс оплата труда, подлежащая получению из-за границы, плюс доходы от собственности, подлежащие получению из-за границы, плюс налоги на производство и импорт за вычетом субсидий, подлежащие получению из-за границы, минус оплата труда, подлежащая выплате за границу, минус доходы от собственности, подлежащие выплате за границу, и минус налоги на производство и импорт за вычетом субсидий, подлежащие выплате за границу.
comment: Gross national income (GNI) is defined as GDP plus compensation of employees receivable from abroad plus property income receivable from abroad plus taxes less subsidies on production receivable from abroad less compensation of employees payable abroad less property income payable abroad and less taxes plus subsidies on production payable abroad.
source: Система национальных счетов 2008
  source: https://stat.semanticpro.org/xwiki/wiki/NationalAccounts/view/%D0%91%D0%B8%D0%B1%D0%BB%D0%B8%D0%BE%D1%82%D0%B5%D0%BA%D0%B0/%D0%A1%D0%B8%D1%81%D1%82%D0%B5%D0%BC%D0%B0%20%D0%BD%D0%B0%D1%86%D0%B8%D0%BE%D…
requires: Сальдо первичных доходов
term status: draft
alternative label: ВНД
alternative label: GNI
definition: Gross national income is the aggregate value of the gross balances of primary incomes for all sectors.
definition: Валовой национальный доход — это общая сумма валовых сальдо первичных доходов всех секторов экономики.
in scheme: Глоссарий
preferred label: Gross National Income
related: Оплата труда
related: Налоги
related: Валовый внутренний продукт
related: Субсидии
related: Доход от собственности
related: Производство
top concept of: Глоссарий

Долговые ценные бумаги
type: Concept
comment: Долговые ценные бумаги включают векселя, облигации, свободно обращающиеся депозитные сертификаты, коммерческие бумаги, долговые обязательства, ценные бумаги, обеспеченные активами и другие подобные инструменты, которые обычно подлежат торговле на финансовых рынках. Ссуды, которые стали обращающимися и могут передаваться от одного держателя к другому, должны быть при определенных условиях переклассифицированы из ссуд в долговые ценные бумаги. Для такой переклассификации должны быть доказательства торговли на вторичном рынке, включая существование «делателей рынка», и частые котировки инструментов, такие как одновременные котировки цен покупателя и продавца. Неучаствующие привилегированные акции — это такие акции, по которым выплачивается фиксированный доход, но которые не предусматривают участия в распределении остаточной стоимости акционерного пред приятия при его роспуске. Эти акции классифицируются как долговые ценные бумаги.
source: Система национальных счетов 2008
  source: https://stat.semanticpro.org/xwiki/wiki/NationalAccounts/view/%D0%91%D0%B8%D0%B1%D0%BB%D0%B8%D0%BE%D1%82%D0%B5%D0%BA%D0%B0/%D0%A1%D0%B8%D1%81%D1%82%D0%B5%D0%BC%D0%B0%20%D0%BD%D0%B0%D1%86%D0%B8%D0%BE%D…
term status: draft
definition: Debt securities are negotiable instruments serving as evidence of a debt.
definition: Долговые ценные бумаги — это обращающиеся инструменты, которые служат свидетельством долга.
in scheme: Глоссарий
preferred label: Debt Securities
related: Цена покупателя
related: Вексель
related: Ценные бумаги
related: Обязательство
related: Актив
related: Ссуды
top concept of: Глоссарий

Баланс продукта
type: Concept
source: Система национальных счетов 2008
  source: https://stat.semanticpro.org/xwiki/wiki/NationalAccounts/view/%D0%91%D0%B8%D0%B1%D0%BB%D0%B8%D0%BE%D1%82%D0%B5%D0%BA%D0%B0/%D0%A1%D0%B8%D1%81%D1%82%D0%B5%D0%BC%D0%B0%20%D0%BD%D0%B0%D1%86%D0%B8%D0%BE%D…
requires: Цена покупателя
requires: Продукты
requires: Промежуточное потребление
requires: Субсидия на продукт
requires: Выпуск
requires: Основная цена
requires: Потребление
requires: Налог на продукт
term status: draft
preferred label: Product Balance
definition: Баланс продукта для любого продукта предполагает, что выпуск в основных ценах плюс импорт, плюс торговая и транспортная наценки, плюс налоги на продукты за вычетом субсидий на продукты равняется сумме промежуточного потребления, конечного потребления и накопления (оцененным в ценах покупателей) плюс экспорт.
definition: The product balance for any product recognizes that the sum of output at basic prices plus imports plus trade and transport margins plus taxes on products less subsidies on products is equal to the sum of intermediate consumption, final consumption and capital formation, all expressed at purchasers’ prices, plus exports.
in scheme: Глоссарий
top concept of: Глоссарий

Улучшения земли
type: Concept
comment: Activities such as land clearance, land contouring, creation of wells and watering holes that are integral to the land in question are to be treated as resulting in land improvements. Activities such as the creation of seawalls, dykes, dams and major irrigation systems which are in the vicinity of the land but not integral to it, which often affect land belonging to several owners and which are often carried out by government, result in assets that are to be classified as structures.
comment: Такую деятельность, как расчистка земли, изменение рельефа, сооружение колодцев и водяных скважин, которые являются неотъемлемой частью участка земли, следует рассматривать как имеющую своим результатом улучшения земли. Такая деятельность, как создание волнорезов, плотин, дамб и ирригационных систем, расположенных вблизи участка земли, но не являющихся его неотъемлемой частью, которые часто влияют на участки земли, принадлежащие нескольким собственникам, часто осуществляется органом государственного управления и воплощается в активах, которые следует классифицировать как сооружения.
source: Система национальных счетов 2008
  source: https://stat.semanticpro.org/xwiki/wiki/NationalAccounts/view/%D0%91%D0%B8%D0%B1%D0%BB%D0%B8%D0%BE%D1%82%D0%B5%D0%BA%D0%B0/%D0%A1%D0%B8%D1%81%D1%82%D0%B5%D0%BC%D0%B0%20%D0%BD%D0%B0%D1%86%D0%B8%D0%BE%D…
requires: Земля
term status: draft
broader: Другие здания и сооружения
definition: Улучшения земли являются результатом действий, которые приводят к существенным увеличениям количества, улучшениям качества или повышению производительности земли, или предотвращают ее деградацию.
definition: Land improvements are the result of actions that lead to major improvements in the quantity, quality or productivity of land, or prevent its deterioration.
in scheme: Глоссарий
preferred label: Land Improvements
related: Земля
related: Органы государственного управления
related: Актив
top concept of: Глоссарий

Налоги на капитал
type: Concept
source: Система национальных счетов 2008
  source: https://stat.semanticpro.org/xwiki/wiki/NationalAccounts/view/%D0%91%D0%B8%D0%B1%D0%BB%D0%B8%D0%BE%D1%82%D0%B5%D0%BA%D0%B0/%D0%A1%D0%B8%D1%81%D1%82%D0%B5%D0%BC%D0%B0%20%D0%BD%D0%B0%D1%86%D0%B8%D0%BE%D…
requires: Налоги
requires: Чистая стоимость капитала
requires: Трансферт
requires: Институциональная единица
requires: Актив
term status: draft
broader: Налоги
definition: Налоги на капитал включают налоги, взимаемые относительно редко и нерегулярно со стоимости активов или чистой стоимости капитала, принадлежащих институциональным единицам, или со стоимости активов, переданных одной институциональной единицей другой институциональной единице в результате наследования имущества, подарков или других трансфертов.
definition: Capital taxes consist of taxes levied at irregular and infrequent intervals on the values of the assets or net worth owned by institutional units or on the values of assets transferred between institutional units as a result of legacies, gifts inter vivos or other transfers.
in scheme: Глоссарий
preferred label: Capital Taxes
top concept of: Глоссарий

Институциональная единица
type: Concept
comment: Главные характеристики институциональных единиц могут быть описаны следующим образом: Институциональная единица имеет право владеть товарами и активами от своего имени; она, следовательно, может обмениваться товарами и активами в операциях с другими институциональными единицами; Она может принимать экономические решения и участвовать в экономической деятельности, за которую она несет прямую ответственность и подотчетна по закону; Она способна принимать обязательства от своего имени, принимать обязательства другого рода и обязательства, связанные с будущей деятельностью, и заключать контракты; Институциональная единица должна иметь полный набор счетов, включая баланс активов и пассивов, или должна существовать возможность составить содержательный с экономической точки зрения набор счетов, если они потребуются.
requires: EconomicActivity
requires: Операция
requires: Обязательство
requires: EconomicAgent
requires: Актив
term status: draft
broader: Институциональный сектор
definition: Институциональная единица — это экономическая единица, которая способна от своего имени владеть активами, принимать обязательства, участвовать в экономической деятельности и вступать в операции с другими единицами.
definition: An institutional unit is an economic entity that is capable, in its own right, of owning assets, incurring liabilities and engaging in economic activities and in transactions with other entities.
in scheme: Глоссарий
preferred label: Institutional unit
related: Баланс активов и пассивов
related: Товары
related: Операция
related: Обязательство
related: Актив
top concept of: Глоссарий

Налоги на продукты, исключая НДС, налоги на импорт и экспорт
type: Concept
comment: К числу наиболее распространенных налогов на продукты, исключая НДС, налоги на импорт и экспорт относятся следующие: a. Общие налоги с продаж или с оборота; b. Акцизы; c. Налоги на конкретные услуги; d. Налоги на операции с капиталом и финансовые операции; e. Прибыли фискальных монополий; f. Налоги, возникающие в результате установления центральным банком процентной ставки более высокой, чем рыночная.
comment: They include the following commonly occurring taxes: a. General sales or turnover taxes; b. Excise duties; c. Taxes on specific services; d. Taxes on financial and capital transactions e. Profits of fiscal monopolies; f. Taxes resulting from the central bank imposing a higher rate of interest than the market rate.
source: Система национальных счетов 2008
  source: https://stat.semanticpro.org/xwiki/wiki/NationalAccounts/view/%D0%91%D0%B8%D0%B1%D0%BB%D0%B8%D0%BE%D1%82%D0%B5%D0%BA%D0%B0/%D0%A1%D0%B8%D1%81%D1%82%D0%B5%D0%BC%D0%B0%20%D0%BD%D0%B0%D1%86%D0%B8%D0%BE%D…
requires: Налоги
requires: Товары
requires: Потребление
requires: Производство
requires: Услуги
term status: draft
broader: Налоги
definition: Taxes on products, excluding VAT, import and export taxes, consist of taxes on goods and services that become payable as a result of the production, sale, transfer, leasing or delivery of those goods or services, or as a result of their use for own consumption or own capital formation.
definition: Налоги на продукты, исключая НДС, налоги на импорт и экспорт, включают налоги на товары и услуги, взимаемые в связи с производством, продажей, передачей, арендой или поставкой этих товаров и услуг, либо в связи с их использованием для собственного потребления или накопления.
in scheme: Глоссарий
preferred label: Taxes on Products, Excluding VAT, Import and Export Taxes
top concept of: Глоссарий

Институциональный сектор
type: Concept
comment: Все институциональные единицы относятся к одному и только к одному из следующих пяти институциональных секторов: сектор нефинансовых корпораций; сектор финансовых корпораций; сектор государственного управления; сектор <a target="_blank" rel="noopener noreferrer" href="https://stat.semanticpro.org/xwiki/wiki/NationalAccounts/view/%D0%93%D0%BB%D0%BE%D1%81%D1%81%D0%B0%D1%80%D0%B8%D0%B8/%D0%9D%D0%B5%D0%BA%D0%BE%D0%BC%D0%BC%D0%B5%D1%80%D1%87%D0%B5%D1%81%D0%BA%D0%B8%D0%B5%20%D0%BE%D1%80%D0%B3%D0%B0%D0%BD%D0%B8%D0%B7%D0%B0%D1%86%D0%B8%D0%B8%2C%20%D0%BE%D0%B1%D1%81%D0%BB%D1%83%D0%B6%D0%B8%D0%B2%D0%B0%D1%8E%D1%89%D0%B8%D0%B5%20%D0%B4%D0%BE%D0%BC%D0%B0%D1%88%D0%BD%D0%B8%D0%B5%20%D1%85%D0%BE%D0%B7%D1%8F%D0%B9%D1%81%D1%82%D0%B2%D0%B0/">некоммерческих организаций, обслуживающих домашние хозяйства; сектор домашних хозяйств.
source:
  source: https://stat.semanticpro.org/xwiki/wiki/NationalAccounts/view/%D0%93%D0%B0%D1%80%D0%BC%D0%BE%D0%BD%D0%B8%D0%B7%D0%B0%D1%86%D0%B8%D1%8F/%D0%93%D0%B0%D1%80%D0%BC%D0%BE%D0%BD%D0%B8%D0%B7%D0%B0%D1%86%D0%B…
requires: Институциональная единица
term status: draft
definition: An institutional unit is an economic entity that is capable, in its own right, of owning assets, incurring liabilities and engaging in economic activities and in transactions with other entities.
definition: Институциональный сектор – совокупность институциональных единиц, однородных с точки зрения их функций в экономике и источников финансирования, обуславливающих их сходное экономическое поведение.
in scheme: Глоссарий
preferred label: Institutional sector
related: Некоммерческие организации, обслуживающие домашние хозяйства
related: Финансовые корпорации
related: Институциональная единица
related: Домашнее хозяйство
related: Органы государственного управления
related: Нефинансовые корпорации
top concept of: Глоссарий

Договор операционного лизинга
type: Concept
comment: Один из признаков операционного лизинга состоит в том, что необходимый ремонт и техническое обслуживание актива обеспечиваются юридическим собственником. При операционном лизинге актив остается на балансе арендодателя. Операционный лизинг предназначался первоначально для удовлетворения потребностей пользователей, которые нуждались в некоторых видах оборудования лишь время от времени. Во многих случаях операционный лизинг все еще предоставляется на короткие периоды, хотя арендополучатели могут возобновлять аренду, когда этот период заканчивается, и один и тот же пользователь может арендовать то же самое оборудование несколько раз. Однако с развитием все более сложных типов оборудования, особенно в области электроники, средства его обслуживания и поддержания, предоставляемые арендодателем, становятся важными факторами, которые могут влиять на решение пользователя об аренде. Другими факторами, которые могут убедить пользователей арендовать на длительные периоды, вместо того, чтобы покупать, являются последствия для баланса предприятия, денежных потоков и налоговых обязательств.
source: Система национальных счетов 2008
  source: https://stat.semanticpro.org/xwiki/wiki/NationalAccounts/view/%D0%91%D0%B8%D0%B1%D0%BB%D0%B8%D0%BE%D1%82%D0%B5%D0%BA%D0%B0/%D0%A1%D0%B8%D1%81%D1%82%D0%B5%D0%BC%D0%B0%20%D0%BD%D0%B0%D1%86%D0%B8%D0%BE%D…
requires: Экономический собственник
requires: Юридический собственник
requires: Актив
requires: Производство
term status: draft
definition: An operating lease is one where the legal owner is also the economic owner and accepts the operating risks and receives the economic benefits from the asset by using it in a productive activity.
definition: Договор операционного лизинга — это договор аренды, в соответствии с которым юридический собственник актива является также его экономическим собственником, принимает на себя операционные риски и получает экономические выгоды от актива путем использования его в производственной деятельности.
in scheme: Глоссарий
preferred label: Operating Lease
related: Предприятие
related: Обязательство
related: Юридический собственник
related: Актив
top concept of: Глоссарий

Единица вида деятельности
type: Concept
comment: Каждое предприятие по определению должно состоять из одной или нескольких единиц вида деятельности. Результаты такого подразделения единицы на две или более единицы вида деятельности являются более однородными с точки зрения выпускаемой ими продукции, структуры их затрат и используемой технологии производства по сравнению с предприятием, рассматриваемым как единое целое.
source: Система национальных счетов 2008
  source: https://stat.semanticpro.org/xwiki/wiki/NationalAccounts/view/%D0%91%D0%B8%D0%B1%D0%BB%D0%B8%D0%BE%D1%82%D0%B5%D0%BA%D0%B0/%D0%A1%D0%B8%D1%81%D1%82%D0%B5%D0%BC%D0%B0%20%D0%BD%D0%B0%D1%86%D0%B8%D0%BE%D…
requires: Предприятие
requires: Валовая добавленная стоимость
requires: Производство
term status: draft
broader: Предприятие
definition: Единица вида деятельности — это предприятие или часть предприятия, которые заняты только одним видом производственной деятельности или в которых большая часть валовой добавленной стоимости получается от основной производственной деятельности.
definition: A kind-of-activity unit is an enterprise, or a part of an enterprise, that engages in only one kind of productive activity or in which the principal productive activity accounts for most of the value added.
in scheme: Глоссарий
preferred label: Kind-of-Activity Unit
related: Предприятие
related: Продукты
related: Производство
top concept of: Глоссарий

Запасы
type: Concept
comment: СНС регистрирует запасы в счетах, которые обычно называются балансами активов и пассивов, составляемых на начало и конец отчетного периода. Однако запасы связаны с потоками: они являются результатом накопления от предыдущих операций и других потоков, и они изменяются в результате операций и других потоков в данном периоде. Они являются результатом непрерывных добавлений к запасам и изъятий из них и некоторых изменений в объеме или стоимости, происходящих в течение периода, пока данный актив или обязательство находятся в запасах.
source: Система национальных счетов 2008
  source: https://stat.semanticpro.org/xwiki/wiki/NationalAccounts/view/%D0%91%D0%B8%D0%B1%D0%BB%D0%B8%D0%BE%D1%82%D0%B5%D0%BA%D0%B0/%D0%A1%D0%B8%D1%81%D1%82%D0%B5%D0%BC%D0%B0%20%D0%BD%D0%B0%D1%86%D0%B8%D0%BE%D…
requires: Обязательство
requires: Актив
term status: draft
definition: Stocks are a position in, or holdings of, assets and liabilities at a point in time.
definition: Запасы — это наличие активов или обязательств на тот или иной момент времени.
in scheme: Глоссарий
preferred label: Stocks
related: Баланс активов и пассивов
related: Операция
related: Другие потоки
related: Обязательство
related: Актив
top concept of: Глоссарий

Вспомогательные финансовые корпорации
type: Concept
comment: Следующие вспомогательные финансовые корпорации относятся к этому подсектору: страховые брокеры, оценщики ущерба и требований (независимо от того, наняты ли они страховой компанией либо являются независимым оценщиком или государственным оценщиком, нанятыми держателем полиса), консультанты по вопросам страхования и пенсионного обеспечения брокеры по операциям с ссудами и ценными бумагами, консультанты по вопросам инвестирования и т. д. корпорации, размещающие займы, которые управляют выпуском ценных бумаг корпорации, основной функцией которых является гарантирование путем индоссамента векселей или аналогичных инструментов корпорации, которые занимаются производными финансовыми инструментами и инструментами хеджирования, такими как свопы, опционы и фьючерсы (без выпуска их) корпорации, обеспечивающие инфраструктуру финансовых рынков управляющие пенсионных фондов, взаимных фондов и т. д. (но не фонды, которыми они управляют) корпорации, предоставляющие услуги фондовой биржи и биржи страхования бюро обмена иностранной валюты некоммерческие организации, признанные как не зависимые юридические лица, обслуживающие финансовые корпорации головные офисы финансовых корпораций, которые, в основном, занимаются контролем финансовых корпораций или групп финансовых корпораций, но сами не осуществляют операции финансовых корпораций центральные контролирующие органы финансовых посредников и финансовых рынков, если они являются отдельными институциональными единицами.
source: Система национальных счетов 2008
  source: https://stat.semanticpro.org/xwiki/wiki/NationalAccounts/view/%D0%91%D0%B8%D0%B1%D0%BB%D0%B8%D0%BE%D1%82%D0%B5%D0%BA%D0%B0/%D0%A1%D0%B8%D1%81%D1%82%D0%B5%D0%BC%D0%B0%20%D0%BD%D0%B0%D1%86%D0%B8%D0%BE%D…
requires: Финансовые корпорации
requires: Корпорация
requires: Финансовые активы
requires: Операция
requires: Обязательство
term status: draft
broader: Финансовые корпорации
definition: Вспомогательные финансовые корпорации включают финансовые корпорации, которые, в основном, заняты видами деятельности, связанными с операциями с финансовыми активами и обязательствами или с предоставлением регулирующего контекста для этих операций, но в обстоятельствах, которые не предполагают, что вспомогательная корпорация становится собственником финансовых активов и обязательств, являющихся предметами операций.
definition: Financial auxiliaries consist of financial corporations that are principally engaged in activities associated with transactions in financial assets and liabilities or with providing the regulatory context for these transactions but in circumstances that do not involve the auxiliary taking ownership of the financial assets and liabilities being transacted.
in scheme: Глоссарий
preferred label: Financial auxiliaries
related: Финансовые корпорации
related: Вексель
related: Ценные бумаги
related: Институциональная единица
related: Корпорация
related: Операция
related: Выпуск
related: Юридическое лицо
related: Услуги
related: Опционы
related: Ссуды
top concept of: Глоссарий

Основная цена
type: Concept
comment: Она исключает любые транспортные расходы, представленные отдельно в счетах-фактурах производителем.
comment: It excludes any transport charges invoiced separately by the producer.
source: Система национальных счетов 2008
  source: https://stat.semanticpro.org/xwiki/wiki/NationalAccounts/view/%D0%91%D0%B8%D0%B1%D0%BB%D0%B8%D0%BE%D1%82%D0%B5%D0%BA%D0%B0/%D0%A1%D0%B8%D1%81%D1%82%D0%B5%D0%BC%D0%B0%20%D0%BD%D0%B0%D1%86%D0%B8%D0%BE%D…
requires: Товары
requires: Налоги
requires: Субсидии
requires: Выпуск
requires: Услуги
requires: Производство
term status: draft
definition: The basic price is the amount receivable by the producer from the purchaser for a unit of a good or service produced as output minus any tax payable, and plus any subsidy receivable, by the producer as a consequence of its production or sale.
definition: Основная цена — это сумма, подлежащая получению производителем от покупателя за единицу товара или услуги, произведенных в качестве выпуска, минус любой налог, подлежащий уплате, и плюс любая субсидия, подлежащая получению производителем, как следствие их производства или продажи.
in scheme: Глоссарий
preferred label: Basic Price
top concept of: Глоссарий

Налоги и пошлины на импорт
type: Concept
comment: Импортированные товары, при ввозе которых на экономическую территорию страны были уплачены все обязательные налоги на импорт, могут впоследствии стать объектом обложения другим налогом или налогами по мере их обращения в рамках экономики данной страны. Например, при прохождении товаров через сеть оптовой или розничной торговли с них могут взиматься акцизные сборы или налоги с продаж, которыми облагаются все без исключения товары - как произведенные предприятиями-резидентами, так и импортные. Налоги, впоследствии уплачиваемые с товаров, уже ввезенных в страну, не относятся к налогам на импорт. Они отражаются как <a target="_blank" rel="noopener noreferrer" href="https://stat.semanticpro.org/xwiki/wiki/NationalAccounts/view/%D0%93%D0%BB%D0%BE%D1%81%D1%81%D0%B0%D1%80%D0%B8%D0%B8/%D0%9D%D0%B0%D0%BB%D0%BE%D0%B3%D0%B8%20%D0%BD%D0%B0%20%D0%BF%D1%80%D0%BE%D0%B4%D1%83%D0%BA%D1%82%D1%8B%2C%20%D0%B8%D1%81%D0%BA%D0%BB%D1%8E%D1%87%D0%B0%D1%8F%20%D0%9D%D0%94%D0%A1%2C%20%D0%BD%D0%B0%D0%BB%D0%BE%D0%B3%D0%B8%20%D0%BD%D0%B0%20%D0%B8%D0%BC%D0%BF%D0%BE%D1%80%D1%82%20%D0%B8%20%D1%8D%D0%BA%D1%81%D0%BF%D0%BE%D1%80%D1%82/">налоги на продукты, исключая НДС, налоги на импорт и экспорт.
source: Система национальных счетов 2008
  source: https://stat.semanticpro.org/xwiki/wiki/NationalAccounts/view/%D0%91%D0%B8%D0%B1%D0%BB%D0%B8%D0%BE%D1%82%D0%B5%D0%BA%D0%B0/%D0%A1%D0%B8%D1%81%D1%82%D0%B5%D0%BC%D0%B0%20%D0%BD%D0%B0%D1%86%D0%B8%D0%BE%D…
requires: Налоги
requires: Товары
requires: Институциональная единица
requires: Услуги
term status: draft
broader: Налоги
definition: Налоги и пошлины на импорт включают налоги на товары и услуги, подлежащие уплате на момент, когда эти товары пересекают национальные или таможенные границы экономической территории страны или когда эти услуги предоставляются производителями-нерезидентами институциональным единицам-резидентам.
definition: Taxes and duties on imports consist of taxes on goods and services that become payable at the moment when those goods cross the national or customs frontiers of the economic territory or when those services are delivered by non-resident producers to resident institutional units.
in scheme: Глоссарий
preferred label: Taxes and Duties on Imports
related: Предприятие
related: Налоги
related: Товары
related: Налоги на продукты, исключая НДС, налоги на импорт и экспорт
top concept of: Глоссарий

Изъятие из дохода квазикорпорации
type: Concept
comment: Доход, который изымают собственники квазикорпораций, аналогичен доходу, изымаемому у корпораций путем выплаты дивидендов акционерам. Поэтому он рассматривается как доход от собственности, получаемый собственниками квазикорпораций. Изъятие из дохода собственниками квазикорпораций необходимо определить, для того чтобы иметь возможность разрабатывать полный набор счетов для единицы и рассматривать ее как институциональную единицу, отдельную от собственника.
source: Система национальных счетов 2008
  source: https://stat.semanticpro.org/xwiki/wiki/NationalAccounts/view/%D0%91%D0%B8%D0%B1%D0%BB%D0%B8%D0%BE%D1%82%D0%B5%D0%BA%D0%B0/%D0%A1%D0%B8%D1%81%D1%82%D0%B5%D0%BC%D0%B0%20%D0%BD%D0%B0%D1%86%D0%B8%D0%BE%D…
requires: Квазикорпорация
term status: draft
definition: Изъятие из дохода квазикорпорации включает ту часть распределяемого дохода, которую изымает собственник квазикорпорации.
definition: Withdrawal of income from a quasi-corporation consists of that part of distributable income that the owner withdraws from the quasi- corporation.
in scheme: Глоссарий
preferred label: Withdrawal of Income from a Quasi-Corporation
related: Дивиденды
related: Квазикорпорация
related: Институциональная единица
related: Корпорация
related: Доход от собственности
top concept of: Глоссарий

Страховые возмещения (кроме выплат по страхованию жизни)
type: Concept
source: Система национальных счетов 2008
  source: https://stat.semanticpro.org/xwiki/wiki/NationalAccounts/view/%D0%91%D0%B8%D0%B1%D0%BB%D0%B8%D0%BE%D1%82%D0%B5%D0%BA%D0%B0/%D0%A1%D0%B8%D1%81%D1%82%D0%B5%D0%BC%D0%B0%20%D0%BD%D0%B0%D1%86%D0%B8%D0%BE%D…
requires: Страхование жизни
term status: draft
definition: Страховые возмещения (кроме выплат по страхованию жизни) — это суммы, подлежащие выплате для возмещения ущерба в результате события, предусмотренного страховым полисом (кроме полиса страхования жизни), в течение текущего отчетного периода.
definition: Non-life insurance claims are the amounts payable in settlement of damages that result from an event covered by a non-life insurance policy during the current accounting period.
in scheme: Глоссарий
preferred label: Non-Life Insurance Claims
top concept of: Глоссарий

Переводимые депозиты
type: Concept
comment: Некоторые типы депозитных счетов обладают только ограниченными характеристиками переводимости; они не включаются в категорию переводимых депозитов и трактуются как другие депозиты. Например, у некоторых депозитов есть такие ограничения, как число платежей третьей стороны, которые могут быть произведены за период, или минимальный размер отдельных платежей третьей стороне. Переводимый депозит не может быть отрицательной величиной. Например, текущий или расчетный банковский счет обычно рассматривают как переводимый депозит, но если остаток на счете превышен, то изъятие средств до нуля отражается как изъятие депозита, а перерасходованные суммы отражаются как предоставление ссуды.
comment: Some types of deposit accounts embody only limited features of transferability; these are excluded from the category of transferable deposits and treated as other deposits. For example, some deposits have restrictions such as on the number of third-party payments that can be made per period or on the minimum size of the individual thirdparty payments. A transferable deposit cannot have a negative value. A bank current or checking account, for example, is normally treated as a transferable deposit but if it is overdrawn, the withdrawal of funds to zero is treated as the withdrawal of a deposit and the amount of the overdraft is treated as the granting of a loan.
source: Система национальных счетов 2008
  source: https://stat.semanticpro.org/xwiki/wiki/NationalAccounts/view/%D0%91%D0%B8%D0%B1%D0%BB%D0%B8%D0%BE%D1%82%D0%B5%D0%BA%D0%B0/%D0%A1%D0%B8%D1%81%D1%82%D0%B5%D0%BC%D0%B0%20%D0%BD%D0%B0%D1%86%D0%B8%D0%BE%D…
term status: draft
alternative label: Переводные депозиты
definition: Переводимые депозиты включают все депозиты, которые могут быть обменены на банкноты и монеты по требованию по номинальной стоимости без штрафов или ограничений и могут быть непосредственно использованы для осуществления платежей чеком, переводом, почтовым переводом, списанием, зачислением или прочими средствами платежа.
definition: Transferable deposits comprise all deposits that: are exchangeable for bank notes and coins on demand at par and without penalty or restriction; and are directly usable for making payments by cheque, draft, giro order, direct debit/credit, or other direct payment facility.
in scheme: Глоссарий
preferred label: Transferable Deposits
related: Другие депозиты
related: Ссуды
top concept of: Глоссарий

Финансовое требование
type: Concept
comment: Как и обязательства, финансовые требования являются безусловными. Кроме того, может существовать финансовое требование, которое дает право кредитору потребовать платеж у дебитора, но тогда как платеж дебитора является безусловным, если он потребован, само требование является дискреционным для кредитора (то есть предъявляется по его усмотрению).
source: Система национальных счетов 2008
  source: https://stat.semanticpro.org/xwiki/wiki/NationalAccounts/view/%D0%91%D0%B8%D0%B1%D0%BB%D0%B8%D0%BE%D1%82%D0%B5%D0%BA%D0%B0/%D0%A1%D0%B8%D1%81%D1%82%D0%B5%D0%BC%D0%B0%20%D0%BD%D0%B0%D1%86%D0%B8%D0%BE%D…
requires: Обязательство
term status: draft
definition: Финансовое требование — это платеж или ряд платежей, которые подлежат выплате кредитору дебитором в соответствии с условиями обязательства.
definition: A financial claim is the payment or series of payments due to the creditor by the debtor under the terms of a liability.
in scheme: Глоссарий
preferred label: Financial Claim
related: Обязательство
top concept of: Глоссарий

Потребление основного капитала
type: Concept
comment: Термин «амортизация» часто используется вместо термина «потребление основного капитала», но он намеренно не используется в СНС, так как в бухгалтерском учете термин «амортизация» часто используется для обозначения снижения первоначальной стоимости основных фондов, тогда как в СНС потребление основного капитала определяется на основе оценки основных фондов в текущих ценах. Потребление основного капитала исчисляется в отношении всех основных фондов, находящихся в собственности производителя, но не в отношении ценностей (драгоценных металлов, камней и т. д.), которые приобретаются как раз в связи с тем, что их стоимость не снижается со временем. Основные фонды должны быть произведены в качестве выпуска процесса производства, как оно определено в СНС. Потребление основного капитала не включает истощение или деградацию природных активов, таких как земля, минералы или другие полезные ископаемые, уголь, нефть, природный газ; оно также не включает контракты, договоры аренды и лицензии.
source: Система национальных счетов 2008
  source: https://stat.semanticpro.org/xwiki/wiki/NationalAccounts/view/%D0%91%D0%B8%D0%B1%D0%BB%D0%B8%D0%BE%D1%82%D0%B5%D0%BA%D0%B0/%D0%A1%D0%B8%D1%81%D1%82%D0%B5%D0%BC%D0%B0%20%D0%BD%D0%B0%D1%86%D0%B8%D0%BE%D…
requires: Запасы
term status: draft
definition: Потребление основного капитала — это уменьшение в течение отчетного периода текущей стоимости запаса основных фондов, принадлежащих производителю и используемых им, в результате физического износа, нормального морального износа или случайных повреждений.
definition: Consumption of fixed capital is the decline, during the course of the accounting period, in the current value of the stock of fixed assets owned and used by a producer as a result of physical deterioration, normal obsolescence or normal accidental damage.
in scheme: Глоссарий
preferred label: Consumption Of Fixed Capital
related: Цена
related: Земля
related: Контракты, договоры аренды и лицензии
related: Выпуск
related: Основные фонды
related: Актив
related: Производство
related: Ценности
top concept of: Глоссарий

Цена производителя
type: Concept
comment: Она не включает транспортные расходы, представленные отдельно в счете-фактуре производителем. Ни цена производителя, ни основная цена не включают любые величины НДС, подлежащие получению, или аналогичные вычитаемые налоги, начисленные на реализованный выпуск. В отличие от основной цены цена производителя включает налоги на продукты (налоги, подлежащие выплате на единицу выпуска) и исключает субсидии на продукты (субсидии, подлежащие получению на единицу выпуска). Цена производителя — это цена, которая не включает НДС, который производитель начисляет покупателю. Основная цена измеряет стоимость, удерживаемую производителем, и, следовательно, она является более адекватной для принятия решений производителем. Во многих странах становится общей практикой для производителей показывать различные виды налогов отдельно в их счетах-фактурах, так что покупатели информированы о том, какие налоги они платят производителю, а какие налоги — органам государственного управления.
source: Система национальных счетов 2008
  source: https://stat.semanticpro.org/xwiki/wiki/NationalAccounts/view/%D0%91%D0%B8%D0%B1%D0%BB%D0%B8%D0%BE%D1%82%D0%B5%D0%BA%D0%B0/%D0%A1%D0%B8%D1%81%D1%82%D0%B5%D0%BC%D0%B0%20%D0%BD%D0%B0%D1%86%D0%B8%D0%BE%D…
requires: Налоги
requires: Товары
requires: Начисленный НДС
requires: Выпуск
requires: Услуги
term status: draft
broader: Цена
definition: The producer’s price is the amount receivable by the producer from the purchaser for a unit of a good or service produced as output minus any VAT, or similar deductible tax, invoiced to the purchaser. It excludes any transport charges invoiced separately by the producer.
definition: Цена производителя — это сумма, подлежащая получению производителем от покупателя за единицу товара или услуги, произведенных в качестве выпуска, минус любой начисленный НДС или аналогичный вычитаемый налог.
example: Цены: Цена производителя на услугу производственного характера не включает косвенные товарные налоги – налог на добавленную стоимость (НДС), акцизы и другие налоги, не входящие в себестоимость услуги.
in scheme: Глоссарий
preferred label: Producer’s Price
related: Налог на добавленную стоимость
related: Цена
related: Налоги
related: Субсидия на продукт
related: Субсидии
related: Основная цена
related: Выпуск
related: Налог на продукт
related: Органы государственного управления
top concept of: Глоссарий

Потребление товаров и услуг
type: Concept
source: Система национальных счетов 2008
  source: https://stat.semanticpro.org/xwiki/wiki/NationalAccounts/view/%D0%91%D0%B8%D0%B1%D0%BB%D0%B8%D0%BE%D1%82%D0%B5%D0%BA%D0%B0/%D0%A1%D0%B8%D1%81%D1%82%D0%B5%D0%BC%D0%B0%20%D0%BD%D0%B0%D1%86%D0%B8%D0%BE%D…
requires: Товары
requires: Производство
requires: Услуги
term status: draft
definition: Consumption of goods and services is the act of completely using up the goods and services in a process of production or for the direct satisfaction of human needs or wants.
definition: Потребление товаров и услуг — это акт полного использования товаров и услуг в процессе производства или для прямого удовлетворения потребностей или желаний человека.
in scheme: Глоссарий
preferred label: Consumption of Goods and Services
top concept of: Глоссарий

Незавершенное производство культивируемых биологических ресурсов
type: Concept
comment: Незавершенное производство подразделяется на незавершенное производство культивируемых биологических ресурсов и на другое незавершенное производство.
source: Система национальных счетов 2008
  source: https://stat.semanticpro.org/xwiki/wiki/NationalAccounts/view/%D0%91%D0%B8%D0%B1%D0%BB%D0%B8%D0%BE%D1%82%D0%B5%D0%BA%D0%B0/%D0%A1%D0%B8%D1%81%D1%82%D0%B5%D0%BC%D0%B0%20%D0%BD%D0%B0%D1%86%D0%B8%D0%BE%D…
requires: Институциональная единица
requires: Выпуск
term status: draft
broader: Незавершенное производство
definition: Незавершенное производство культивируемых биологических ресурсов состоит из выпуска ресурсов, которые еще не достигли продуктивного состояния, в котором они обычно поставляются другим институциональным единицам.
definition: Work-in-progress on cultivated biological resources consists of output that is not yet sufficiently mature to be in a state in which it is normally supplied to other institutional units.
in scheme: Глоссарий
preferred label: Work-in-Progress on Cultivated Biological Resources
related: Другое незавершенное производство
related: Незавершенное производство
top concept of: Глоссарий

Налог на продукт
type: Concept
comment: Налог может определяться как установленная сумма, взимаемая с единицы измерения товара или услуги (единица измерения может отражать дискретные единицы или непрерывные физические переменные, например, объем, вес, силу, расстояние, время и т. д.), либо как определенный процент от цены единицы или общей стоимости реализованных товаров и услуг. Налог на продукт, как правило, подлежит уплате на момент производства продукта, его продажи или импорта, однако он может подлежать выплате и при других обстоятельствах, например, когда продукт экспортируется, сдается в аренду, передается в качестве трансферта, поставляется другим единицам или используется для собственного потребления или накопления. В счетах-фактурах, выставляемых предприятиями своим клиентам, сумма налога на продукт может выделяться отдельно, а может и не выделяться.
comment: The tax may be a specific amount of money per unit of quantity of a good or service (the quantity units being measured either in terms of discrete units or continuous physical variables such as volume, weight, strength, distance, time, etc.), or it may be calculated ad valorem as a specified percentage of the price per unit or value of the goods or services transacted. A tax on a product usually becomes payable when it is produced, sold or imported, but it may also become payable in other circumstances, such as when a good is exported, leased, transferred, delivered, or used for own consumption or own capital formation. An enterprise may or may not itemize the amount of a tax on a product separately on the invoice or bill that it charges its customers.
source: Система национальных счетов 2008
  source: https://stat.semanticpro.org/xwiki/wiki/NationalAccounts/view/%D0%91%D0%B8%D0%B1%D0%BB%D0%B8%D0%BE%D1%82%D0%B5%D0%BA%D0%B0/%D0%A1%D0%B8%D1%81%D1%82%D0%B5%D0%BC%D0%B0%20%D0%BD%D0%B0%D1%86%D0%B8%D0%BE%D…
requires: Товары
requires: Налоги
requires: Услуги
term status: draft
broader: Налоги
definition: A tax on a product is a tax that is payable per unit of some good or service.
definition: Налог на продукт — это налог, подлежащий уплате за единицу какого-либо товара или услуги.
in scheme: Глоссарий
preferred label: Tax on a Product
related: Предприятие
related: Цена
related: Продукты
related: Трансферт
related: Товары
related: Налоги
related: Потребление
related: Процент
related: Услуги
related: Производство
top concept of: Глоссарий

Некультивируемые биологические ресурсы
type: Concept
comment: Примерами являются дикорастущие леса и рыбные ресурсы в пределах территории страны. Следует включать в данную категорию только те ресурсы, которые в настоящее время могут эксплуатироваться в экономических целях или если существует вероятность этого в ближайшем будущем.
comment: Examples are virgin forests and fisheries within the territory of the country. Only those resources that are currently, or are likely soon to be, exploitable for economic purposes should be included.
source: Система национальных счетов 2008
  source: https://stat.semanticpro.org/xwiki/wiki/NationalAccounts/view/%D0%91%D0%B8%D0%B1%D0%BB%D0%B8%D0%BE%D1%82%D0%B5%D0%BA%D0%B0/%D0%A1%D0%B8%D1%81%D1%82%D0%B5%D0%BC%D0%B0%20%D0%BD%D0%B0%D1%86%D0%B8%D0%BE%D…
requires: Продукты
requires: Институциональная единица
term status: draft
definition: Некультивируемые биологические ресурсы состоят из животных, птиц, рыбы и растений, которые приносят продукцию как только однократно, так и многократно, на которые установлены и обеспечены права собственности, но у которых естественный рост и воспроизводство не находятся под непосредственным контролем, ответственностью и управлением институциональных единиц.
definition: Non-cultivated biological resources consist of animals, birds, fish and plants that yield both once-only and repeat products over which ownership rights are enforced but for which natural growth or regeneration is not under the direct control, responsibility and management of institutional units.
in scheme: Глоссарий
preferred label: Non-Cultivated Biological Resources
top concept of: Глоссарий

Предприятие
type: Concept
comment: Термин «предприятие» может относиться к корпорации, квазикорпорации, некоммерческой организации или некорпорированному предприятию. Поскольку корпорации и НКО, за исключением <a target="_blank" rel="noopener noreferrer" href="https://stat.semanticpro.org/xwiki/wiki/NationalAccounts/view/%D0%93%D0%BB%D0%BE%D1%81%D1%81%D0%B0%D1%80%D0%B8%D0%B8/%D0%9D%D0%B5%D0%BA%D0%BE%D0%BC%D0%BC%D0%B5%D1%80%D1%87%D0%B5%D1%81%D0%BA%D0%B8%D0%B5%20%D0%BE%D1%80%D0%B3%D0%B0%D0%BD%D0%B8%D0%B7%D0%B0%D1%86%D0%B8%D0%B8%2C%20%D0%BE%D0%B1%D1%81%D0%BB%D1%83%D0%B6%D0%B8%D0%B2%D0%B0%D1%8E%D1%89%D0%B8%D0%B5%20%D0%B4%D0%BE%D0%BC%D0%B0%D1%88%D0%BD%D0%B8%D0%B5%20%D1%85%D0%BE%D0%B7%D1%8F%D0%B9%D1%81%D1%82%D0%B2%D0%B0/">НКОДХ, главным образом, создаются для осуществления производственной деятельности, вся информация о них, отражаемая в счетах, относится к производству и связанной с ним деятельности по накоплению. Органы государственного управления, домашние хозяйства и <a target="_blank" rel="noopener noreferrer" href="https://stat.semanticpro.org/xwiki/wiki/NationalAccounts/view/%D0%93%D0%BB%D0%BE%D1%81%D1%81%D0%B0%D1%80%D0%B8%D0%B8/%D0%9D%D0%B5%D0%BA%D0%BE%D0%BC%D0%BC%D0%B5%D1%80%D1%87%D0%B5%D1%81%D0%BA%D0%B8%D0%B5%20%D0%BE%D1%80%D0%B3%D0%B0%D0%BD%D0%B8%D0%B7%D0%B0%D1%86%D0%B8%D0%B8%2C%20%D0%BE%D0%B1%D1%81%D0%BB%D1%83%D0%B6%D0%B8%D0%B2%D0%B0%D1%8E%D1%89%D0%B8%D0%B5%20%D0%B4%D0%BE%D0%BC%D0%B0%D1%88%D0%BD%D0%B8%D0%B5%20%D1%85%D0%BE%D0%B7%D1%8F%D0%B9%D1%81%D1%82%D0%B2%D0%B0/">НКОДХ безусловно осуществляют операции, связанные с конечным потреблением, но они могут также заниматься производственной деятельностью; в действительности, органы государственного управления и <a target="_blank" rel="noopener noreferrer" href="https://stat.semanticpro.org/xwiki/wiki/NationalAccounts/view/%D0%93%D0%BB%D0%BE%D1%81%D1%81%D0%B0%D1%80%D0%B8%D0%B8/%D0%9D%D0%B5%D0%BA%D0%BE%D0%BC%D0%BC%D0%B5%D1%80%D1%87%D0%B5%D1%81%D0%BA%D0%B8%D0%B5%20%D0%BE%D1%80%D0%B3%D0%B0%D0%BD%D0%B8%D0%B7%D0%B0%D1%86%D0%B8%D0%B8%2C%20%D0%BE%D0%B1%D1%81…
source: Система национальных счетов 2008
  source: https://stat.semanticpro.org/xwiki/wiki/NationalAccounts/view/%D0%91%D0%B8%D0%B1%D0%BB%D0%B8%D0%BE%D1%82%D0%B5%D0%BA%D0%B0/%D0%A1%D0%B8%D1%81%D1%82%D0%B5%D0%BC%D0%B0%20%D0%BD%D0%B0%D1%86%D0%B8%D0%BE%D…
requires: Товары
requires: Институциональная единица
requires: Услуги
term status: draft
broader: Институциональная единица
definition: An enterprise is the view of an institutional unit as a producer of goods and services.
definition: Предприятие — институциональная единица, являющаяся производителем товаров и услуг.
in scheme: Глоссарий
preferred label: Enterprise
related: Некоммерческие организации, обслуживающие домашние хозяйства
related: Корпорация
related: Операция
related: Потребление
related: Домашнее хозяйство
related: Органы государственного управления
related: Производство
related: Некоммерческие организации
top concept of: Глоссарий

Разрешения на использование природных ресурсов
type: Concept
source: Система национальных счетов 2008
  source: https://stat.semanticpro.org/xwiki/wiki/NationalAccounts/view/%D0%91%D0%B8%D0%B1%D0%BB%D0%B8%D0%BE%D1%82%D0%B5%D0%BA%D0%B0/%D0%A1%D0%B8%D1%81%D1%82%D0%B5%D0%BC%D0%B0%20%D0%BD%D0%B0%D1%86%D0%B8%D0%BE%D…
requires: Природные ресурсы
term status: draft
definition: Разрешения на использование природных ресурсов — это права собственности третьей стороны, относящиеся к природным ресурсам.
definition: Permits to use natural resources are third-party property rights relating to natural resources.
in scheme: Глоссарий
preferred label: Permits To Use Natural Resources
top concept of: Глоссарий

Налоги на доходы
type: Concept
comment: Оценка размера налогов производится на основе фактического или предполагаемого дохода физических лиц, домашних хозяйств, <a target="_blank" rel="noopener noreferrer" href="https://stat.semanticpro.org/xwiki/wiki/NationalAccounts/view/%D0%93%D0%BB%D0%BE%D1%81%D1%81%D0%B0%D1%80%D0%B8%D0%B8/%D0%9D%D0%B5%D0%BA%D0%BE%D0%BC%D0%BC%D0%B5%D1%80%D1%87%D0%B5%D1%81%D0%BA%D0%B8%D0%B5%20%D0%BE%D1%80%D0%B3%D0%B0%D0%BD%D0%B8%D0%B7%D0%B0%D1%86%D0%B8%D0%B8%2C%20%D0%BE%D0%B1%D1%81%D0%BB%D1%83%D0%B6%D0%B8%D0%B2%D0%B0%D1%8E%D1%89%D0%B8%D0%B5%20%D0%B4%D0%BE%D0%BC%D0%B0%D1%88%D0%BD%D0%B8%D0%B5%20%D1%85%D0%BE%D0%B7%D1%8F%D0%B9%D1%81%D1%82%D0%B2%D0%B0/">НКОДХ и корпораций. Они включают налоги, которыми облагается имущество, земля или недвижимость, если они используются в качестве основы для оценки доходов их владельцев. В некоторых случаях размер налогового обязательства может быть установлен только в более поздний отчетный период, а не в период получения дохода. Поэтому при определении времени отражения таких налогов следует использовать гибкий подход. Налоги на доходы, удерживаемые у источника (например, налоги, уплачиваемые по мере получения доходов, и регулярные авансовые платежи налогов на доходы), регистрируются в том периоде, когда они уплачиваются, а окончательная сумма налогового обязательства отражается в счетах того периода, в котором обязательство было определено. Налоги на доходы включают следующие виды налогов: a. Налоги на доходы физических лиц или домашних хозяйств; b. Налоги на доходы корпораций; d. Налоги на выигрыши в лотереях и азартных играх.
source: Система национальных счетов 2008
  source: https://stat.semanticpro.org/xwiki/wiki/NationalAccounts/view/%D0%91%D0%B8%D0%B1%D0%BB%D0%B8%D0%BE%D1%82%D0%B5%D0%BA%D0%B0/%D0%A1%D0%B8%D1%81%D1%82%D0%B5%D0%BC%D0%B0%20%D0%BD%D0%B0%D1%86%D0%B8%D0%BE%D…
requires: Налоги
term status: draft
broader: Налоги
definition: Налоги на доходы включают налоги на доходы, прибыли и холдинговые прибыли.
definition: Taxes on income consist of taxes on incomes, profits and capital gains.
in scheme: Глоссарий
preferred label: Taxes on Income
related: Некоммерческие организации, обслуживающие домашние хозяйства
related: Налоги
related: Корпорация
related: Земля
related: Домашнее хозяйство
related: Обязательство
top concept of: Глоссарий

Юридическое лицо
type: Concept
comment: Такие единицы ответственны или подотчетны за экономические решения или действия, которые они предпринимают, хотя их автономность может быть ограничена в некоторой степени другими институциональными единицами; например, корпорации в конечном итоге контролируются их акционерами. Поведение некоторых некорпорированных предприятий, принадлежащих домашним хозяйствам или органам государственного управления, аналогично поведению корпораций, и поэтому такие предприятия рассматриваются как квазикорпорации, если у них есть полный набор счетов.
term status: draft
alternative label: Social entity
alternative label: Общественная организация
broader: Институциональная единица
definition: Юридическое лицо или общественная организация — это такая единица, существование которой признано законом или обществом, независимо от физических лиц или других юридических единиц, которые, возможно, являются их собственниками или контролируют их.
definition: A legal or social entity is one whose existence is recognized by law or society independently of the persons, or other entities, that may own or control it.
in scheme: Глоссарий
preferred label: Legal entity
related: Предприятие
related: Квазикорпорация
related: Институциональная единица
related: Корпорация
related: Домашнее хозяйство
related: Некорпорированное предприятие
related: Органы государственного управления
top concept of: Глоссарий

Другие капитальные трансферты
type: Concept
comment: Особой категорией, рассматриваемой здесь, является прощение долга по взаимной договоренности между кредитором и дебитором. Такая операция отражается как капитальный трансферт от кредитора к дебитору, равный стоимости неуплаченного долга на момент прощения. Эта операция включает прощение долга нерезидентом резиденту и наоборот, но не ограничивается этим.
source: Система национальных счетов 2008
  source: https://stat.semanticpro.org/xwiki/wiki/NationalAccounts/view/%D0%91%D0%B8%D0%B1%D0%BB%D0%B8%D0%BE%D1%82%D0%B5%D0%BA%D0%B0/%D0%A1%D0%B8%D1%81%D1%82%D0%B5%D0%BC%D0%B0%20%D0%BD%D0%B0%D1%86%D0%B8%D0%BE%D…
requires: Инвестиционные гранты
requires: Налоги на капитал
requires: Капитальные трансферты
term status: draft
definition: Другие капитальные трансферты включают все капитальные трансферты за исключением налогов на капитал и инвестиционных грантов
definition: Other capital transfers consist of all capital transfers except capital taxes and investment grants.
in scheme: Глоссарий
preferred label: Other Capital Transfers
related: Операция
related: Капитальные трансферты
top concept of: Глоссарий

Финансовые корпорации
type: Concept
comment: Сектор финансовых корпораций состоит из следующей совокупности резидентских институциональных единиц: все резидентские финансовые корпорации (как они понимаются в СНС, а не только <a target="_blank" rel="noopener noreferrer" href="https://stat.semanticpro.org/xwiki/wiki/NationalAccounts/view/%D0%93%D0%BB%D0%BE%D1%81%D1%81%D0%B0%D1%80%D0%B8%D0%B8/%D0%9A%D0%BE%D1%80%D0%BF%D0%BE%D1%80%D0%B0%D1%86%D0%B8%D1%8F%2C%20%D1%83%D1%87%D1%80%D0%B5%D0%B6%D0%B4%D0%B5%D0%BD%D0%BD%D0%B0%D1%8F%20%D0%BA%D0%B0%D0%BA%20%D1%8E%D1%80%D0%B8%D0%B4%D0%B8%D1%87%D0%B5%D1%81%D0%BA%D0%BE%D0%B5%20%D0%BB%D0%B8%D1%86%D0%BE/">корпорации, учрежденные как юридические лица) независимо от резидентства их акционеров; филиалы нерезидентских предприятий, которые заняты финансовой деятельностью на экономической территории данной страны в течение длительного периода времени; все резидентские НКО, которые являются рыночными производителями финансовых услуг.
requires: Институциональная единица
requires: Корпорация
requires: Услуги
term status: draft
broader: Институциональный сектор
definition: Financial corporations consist of all resident corporations that are principally engaged in providing financial services, including insurance and pension funding services, to other institutional units.
definition: Финансовые корпорации включают все резидентские корпорации, которые в основном заняты предоставлением финансовых услуг другим институциональным единицам, в том числе услуг страхования и пенсионных фондов.
in scheme: Глоссарий
preferred label: Financial corporations
related: Предприятие
related: Институциональная единица
related: Рыночные производители
related: Корпорация, учрежденная как юридическое лицо
related: Услуги
related: Резидентство
related: Некоммерческие организации
top concept of: Глоссарий

Акционерный капитал
type: Concept
comment: Акционерный капитал рассматривается как обязательства институциональной единицы, выпустившей акции.
source: Система национальных счетов 2008
  source: https://stat.semanticpro.org/xwiki/wiki/NationalAccounts/view/%D0%91%D0%B8%D0%B1%D0%BB%D0%B8%D0%BE%D1%82%D0%B5%D0%BA%D0%B0/%D0%A1%D0%B8%D1%81%D1%82%D0%B5%D0%BC%D0%B0%20%D0%BD%D0%B0%D1%86%D0%B8%D0%BE%D…
requires: Квазикорпорация
requires: Корпорация
requires: Актив
term status: draft
definition: ​​​​​​Equity comprises all instruments and records acknowledging claims on the residual value of a corporation or quasi-corporation after the claims of all creditors have been met.
definition: Акционерный капитал включает все инструменты и документы, подтверждающие требования на остаточную стоимость активов корпорации или квазикорпорации после того, как требования всех кредиторов удовлетворены.
in scheme: Глоссарий
preferred label: Equity
related: Институциональная единица
related: Обязательство
top concept of: Глоссарий

Граница активов
type: Concept
source: Система национальных счетов 2008
  source: https://stat.semanticpro.org/xwiki/wiki/NationalAccounts/view/%D0%91%D0%B8%D0%B1%D0%BB%D0%B8%D0%BE%D1%82%D0%B5%D0%BA%D0%B0/%D0%A1%D0%B8%D1%81%D1%82%D0%B5%D0%BC%D0%B0%20%D0%BD%D0%B0%D1%86%D0%B8%D0%BE%D…
requires: Товары
requires: Производство
requires: Услуги
term status: draft
definition: Граница активов в отношении основных фондов охватывает товары и услуги, которые используются в производстве более одного года.
definition: The asset boundary for fixed assets consists of goods and services that are used in production for more than one year.
in scheme: Глоссарий
preferred label: Asset Boundary
top concept of: Глоссарий

Портфельные инвестиции
type: Concept
source: Система национальных счетов 2008
  source: https://stat.semanticpro.org/xwiki/wiki/NationalAccounts/view/%D0%91%D0%B8%D0%B1%D0%BB%D0%B8%D0%BE%D1%82%D0%B5%D0%BA%D0%B0/%D0%A1%D0%B8%D1%81%D1%82%D0%B5%D0%BC%D0%B0%20%D0%BD%D0%B0%D1%86%D0%B8%D0%BE%D…
requires: Ценные бумаги
requires: Прямые инвестиции
requires: Операция
requires: Резервные активы
term status: draft
definition: Portfolio investment is defined as cross-border transactions and positions involving debt or equity securities, other than those included in direct investment or reserve assets.
definition: Портфельные инвестиции определяются как трансграничные операции с долговыми и долевыми ценными бумагами и позиции по ним, не относящиеся к категориям прямых инвестиций или резервных активов.
in scheme: Глоссарий
preferred label: Portfolio Investment
top concept of: Глоссарий

Другие субсидии на производство
type: Concept
comment: К таким субсидиям относятся, например, следующие: субсидии на фонд заработной платы или рабочую силу субсидии на затраты, связанные с уменьшением загрязнения окружающей среды.
comment: Examples of such subsidies are the following: a. Subsidies on payroll or workforce; b. Subsidies to reduce pollution.
source: Система национальных счетов 2008
  source: https://stat.semanticpro.org/xwiki/wiki/NationalAccounts/view/%D0%91%D0%B8%D0%B1%D0%BB%D0%B8%D0%BE%D1%82%D0%B5%D0%BA%D0%B0/%D0%A1%D0%B8%D1%81%D1%82%D0%B5%D0%BC%D0%B0%20%D0%BD%D0%B0%D1%86%D0%B8%D0%BE%D…
requires: Предприятие
requires: Субсидия на продукт
requires: Субсидии
requires: Производство
term status: draft
broader: Субсидии
definition: Другие субсидии на производство представляют собой субсидии, кроме субсидий на продукты, которые предприятия-резиденты могут получать в результате их участия в производстве.
definition: Other subsidies on production consist of subsidies except subsidies on products that resident enterprises may receive as a consequence of engaging in production.
in scheme: Глоссарий
preferred label: Other Subsidies on Production
top concept of: Глоссарий

Корпорация
type: Concept
comment: Корпорации могут быть резидентами стран, отличных от стран резидентства их акционеров, и дочерние корпорации могут иметь резидентство в странах, отличных от резидентства материнской корпорации.
requires: Квазикорпорация
requires: Корпорация, учрежденная как юридическое лицо
term status: draft
broader: Институциональная единица
definition: The term corporation covers legally constituted corporations and also cooperatives, limited liability partnerships, notional resident units and quasi-corporations.
definition: Термин «корпорация» охватывает <a target="_blank" rel="noopener noreferrer" href="https://stat.semanticpro.org/xwiki/wiki/NationalAccounts/view/%D0%93%D0%BB%D0%BE%D1%81%D1%81%D0%B0%D1%80%D0%B8%D0%B8/%D0%9A%D0%BE%D1%80%D0%BF%D0%BE%D1%80%D0%B0%D1%86%D0%B8%D1%8F%2C%20%D1%83%D1%87%D1%80%D0%B5%D0%B6%D0%B4%D0%B5%D0%BD%D0%BD%D0%B0%D1%8F%20%D0%BA%D0%B0%D0%BA%20%D1%8E%D1%80%D0%B8%D0%B4%D0%B8%D1%87%D0%B5%D1%81%D0%BA%D0%BE%D0%B5%20%D0%BB%D0%B8%D1%86%D0%BE/">корпорации, учрежденные как юридические лица, а также кооперативы, партнерства с ограниченной ответственностью, условные резидентские единицы и квазикорпорации.
in scheme: Глоссарий
preferred label: Corporation
related: Резидентство
top concept of: Глоссарий

Гудвилл и маркетинговые активы
type: Concept
comment: Хотя гудвилл, вероятно, будет присутствовать в большинстве корпораций, с целью обеспечения точности измерения он отражается в СНС только тогда, когда его стоимость подтверждается рыночной сделкой, обычно в результате продажи корпорации в целом. В порядке исключения идентифицированные маркетинговые активы могут быть проданы индивидуально и отдельно от целой корпорации, в результате чего их продажа должна также быть отражена по этому определению.
source: Система национальных счетов 2008
  source: https://stat.semanticpro.org/xwiki/wiki/NationalAccounts/view/%D0%91%D0%B8%D0%B1%D0%BB%D0%B8%D0%BE%D1%82%D0%B5%D0%BA%D0%B0/%D0%A1%D0%B8%D1%81%D1%82%D0%B5%D0%BC%D0%B0%20%D0%BD%D0%B0%D1%86%D0%B8%D0%BE%D…
requires: Предприятие
requires: Обязательство
requires: Актив
term status: draft
broader: Непроизведенные активы
definition: Стоимость гудвилла и маркетинговых активов определяется как разница между стоимостью, выплаченной за действующее предприятие, и суммой его активов за вычетом суммы его обязательств, каждая статья которых отдельно идентифицирована и оценена.
definition: The value of goodwill and marketing assets is defined as the difference between the value paid for an enterprise as a going concern and the sum of its assets less the sum of its liabilities, each item of which has been separately identified and valued.
in scheme: Глоссарий
preferred label: Goodwill and Marketing Assets
related: Корпорация
related: Актив
top concept of: Глоссарий

Ссуды
type: Concept
source: Система национальных счетов 2008
  source: https://stat.semanticpro.org/xwiki/wiki/NationalAccounts/view/%D0%91%D0%B8%D0%B1%D0%BB%D0%B8%D0%BE%D1%82%D0%B5%D0%BA%D0%B0/%D0%A1%D0%B8%D1%81%D1%82%D0%B5%D0%BC%D0%B0%20%D0%BD%D0%B0%D1%86%D0%B8%D0%BE%D…
requires: Финансовые активы
term status: draft
broader: Финансовые активы
definition: Ссуды являются финансовыми активами, которые возникают, когда кредитор предоставляет средства в долг непосредственно дебитору, и оформляются документами, которые не являются обращающимися.
definition: Loans are financial assets that: a. are created when a creditor lends funds directly to a debtor, and b. are evidenced by documents that are not negotiable.
in scheme: Глоссарий
preferred label: Loans
top concept of: Глоссарий

Реальный валовой внутренний доход
type: Concept
comment: It is a concept that exists in real terms only. When the terms of trade change there may be a significant divergence between the movements of GDP in volume terms and real GDI.
comment: Это концепция, которая существует только в реальном выражении. Когда условия внешней торговли меняются, могут возникнуть существенные расхождения между динамикой объема ВВП и динамикой реального ВВД.
source: Система национальных счетов 2008
  source: https://stat.semanticpro.org/xwiki/wiki/NationalAccounts/view/%D0%91%D0%B8%D0%B1%D0%BB%D0%B8%D0%BE%D1%82%D0%B5%D0%BA%D0%B0/%D0%A1%D0%B8%D1%81%D1%82%D0%B5%D0%BC%D0%B0%20%D0%BD%D0%B0%D1%86%D0%B8%D0%BE%D…
requires: Производство
term status: draft
alternative label: Real GDI
alternative label: Реальный ВВД
definition: Реальный валовой внутренний доход (реальный ВВД) измеряет покупательную способность совокупных доходов, созданных отечественным производством.
definition: Real gross domestic income (real GDI) measures the purchasing power of the total incomes generated by domestic production.
in scheme: Глоссарий
preferred label: Real Gross Domestic Income
related: Валовый внутренний продукт
related: Условия внешней торговли
top concept of: Глоссарий

Фактическое конечное потребление сектора НКОДХ
type: Concept
comment: Стоимость фактического конечного потребления <a target="_blank" rel="noopener noreferrer" href="https://stat.semanticpro.org/xwiki/wiki/NationalAccounts/view/%D0%93%D0%BB%D0%BE%D1%81%D1%81%D0%B0%D1%80%D0%B8%D0%B8/%D0%9D%D0%B5%D0%BA%D0%BE%D0%BC%D0%BC%D0%B5%D1%80%D1%87%D0%B5%D1%81%D0%BA%D0%B8%D0%B5%20%D0%BE%D1%80%D0%B3%D0%B0%D0%BD%D0%B8%D0%B7%D0%B0%D1%86%D0%B8%D0%B8%2C%20%D0%BE%D0%B1%D1%81%D0%BB%D1%83%D0%B6%D0%B8%D0%B2%D0%B0%D1%8E%D1%89%D0%B8%D0%B5%20%D0%B4%D0%BE%D0%BC%D0%B0%D1%88%D0%BD%D0%B8%D0%B5%20%D1%85%D0%BE%D0%B7%D1%8F%D0%B9%D1%81%D1%82%D0%B2%D0%B0/">НКОДХ равна стоимости их общих расходов на конечное потребление за вычетом их расходов на индивидуальные товары или услуги, предоставляемые в качестве <a target="_blank" rel="noopener noreferrer" href="https://stat.semanticpro.org/xwiki/wiki/NationalAccounts/view/%D0%93%D0%BB%D0%BE%D1%81%D1%81%D0%B0%D1%80%D0%B8%D0%B8/%D0%A1%D0%BE%D1%86%D0%B8%D0%B0%D0%BB%D1%8C%D0%BD%D1%8B%D0%B5%20%D1%82%D1%80%D0%B0%D0%BD%D1%81%D1%84%D0%B5%D1%80%D1%82%D1%8B%20%D0%B2%20%D0%BD%D0%B0%D1%82%D1%83%D1%80%D0%B0%D0%BB%D1%8C%D0%BD%D0%BE%D0%B9%20%D1%84%D0%BE%D1%80%D0%BC%D0%B5/">социальных трансфертов в натуральной форме домашним хозяйствам. Стоимость фактического конечного потребления <a target="_blank" rel="noopener noreferrer" href="https://stat.semanticpro.org/xwiki/wiki/NationalAccounts/view/%D0%93%D0%BB%D0%BE%D1%81%D1%81%D0%B0%D1%80%D0%B8%D0%B8/%D0%9D%D0%B5%D0%BA%D0%BE%D0%BC%D0%BC%D0%B5%D1%80%D1%87%D0%B5%D1%81%D0%BA%D0%B8%D0%B5%20%D0%BE%D1%80%D0%B3%D0%B0%D0%BD%D0%B8%D0%B7%D0%B0%D1%86%D0%B8%D0%B8%2C%20%D0%BE%D0%B1%D1%81%D0%BB%D1%83%D0%B6%D0%B8%D0%B2%D0%B0%D1%8E%D1%89%D0%B8%D0%B5%20%D0%B4%D0%BE%D0%BC%D0%B0%D1%88%D0%BD%D0%B8%D0%B5%20%D1%85%D0%BE%D0%B7%D1%8F%D0%B9%D1%81%D1%82%D0%B2%D0%B0/">НКОДХ, таким образом, равна стоимости расходов, которые они несут в связи с предоставлением коллективных услуг. Если не представляется возможным идентифицировать и измерить коллективные услуги, предоставляемые <a target="_blank" rel="noopener noreferrer" hre…
source: Система национальных счетов 2008
  source: https://stat.semanticpro.org/xwiki/wiki/NationalAccounts/view/%D0%91%D0%B8%D0%B1%D0%BB%D0%B8%D0%BE%D1%82%D0%B5%D0%BA%D0%B0/%D0%A1%D0%B8%D1%81%D1%82%D0%B5%D0%BC%D0%B0%20%D0%BD%D0%B0%D1%86%D0%B8%D0%BE%D…
requires: Некоммерческие организации, обслуживающие домашние хозяйства
requires: Услуга коллективного потребления
term status: draft
broader: Фактическое конечное потребление
definition: Actual final consumption of NPISHs is measured by the value of the collective consumption services provided to the community, or large sections of the community, by NPISHs.
definition: Фактическое конечное потребление сектора НКОДХ определяется как стоимость услуг коллективного потребления, предоставленных <a target="_blank" rel="noopener noreferrer" href="https://stat.semanticpro.org/xwiki/wiki/NationalAccounts/view/%D0%93%D0%BB%D0%BE%D1%81%D1%81%D0%B0%D1%80%D0%B8%D0%B8/%D0%9D%D0%B5%D0%BA%D0%BE%D0%BC%D0%BC%D0%B5%D1%80%D1%87%D0%B5%D1%81%D0%BA%D0%B8%D0%B5%20%D0%BE%D1%80%D0%B3%D0%B0%D0%BD%D0%B8%D0%B7%D0%B0%D1%86%D0%B8%D0%B8%2C%20%D0%BE%D0%B1%D1%81%D0%BB%D1%83%D0%B6%D0%B8%D0%B2%D0%B0%D1%8E%D1%89%D0%B8%D0%B5%20%D0%B4%D0%BE%D0%BC%D0%B0%D1%88%D0%BD%D0%B8%D0%B5%20%D1%85%D0%BE%D0%B7%D1%8F%D0%B9%D1%81%D1%82%D0%B2%D0%B0/">НКОДХ обществу в целом или большим частям общества.
in scheme: Глоссарий
preferred label: Actual Final Consumption of NPISHs
related: Фактическое конечное потребление
related: Некоммерческие организации, обслуживающие домашние хозяйства
related: Товары
related: Расходы на конечное потребление
related: Социальные трансферты в натуральной форме
related: Домашнее хозяйство
related: Услуги
top concept of: Глоссарий

Фактическое конечное потребление сектора государственного управления
type: Concept
comment: Стоимость фактического конечного потребления сектора государственного управления равна стоимости его общих расходов на конечное потребление за вычетом его расходов на индивидуальные товары или услуги, предоставленные в качестве <a target="_blank" rel="noopener noreferrer" href="https://stat.semanticpro.org/xwiki/wiki/NationalAccounts/view/%D0%93%D0%BB%D0%BE%D1%81%D1%81%D0%B0%D1%80%D0%B8%D0%B8/%D0%A1%D0%BE%D1%86%D0%B8%D0%B0%D0%BB%D1%8C%D0%BD%D1%8B%D0%B5%20%D1%82%D1%80%D0%B0%D0%BD%D1%81%D1%84%D0%B5%D1%80%D1%82%D1%8B%20%D0%B2%20%D0%BD%D0%B0%D1%82%D1%83%D1%80%D0%B0%D0%BB%D1%8C%D0%BD%D0%BE%D0%B9%20%D1%84%D0%BE%D1%80%D0%BC%D0%B5/">социальных трансфертов в натуральной форме домашним хозяйствам. Стоимость фактического конечного потребления единиц сектора государственного управления, таким образом, равна стоимости расходов, которые они осуществляют на предоставление коллективных услуг.
source: Система национальных счетов 2008
  source: https://stat.semanticpro.org/xwiki/wiki/NationalAccounts/view/%D0%91%D0%B8%D0%B1%D0%BB%D0%B8%D0%BE%D1%82%D0%B5%D0%BA%D0%B0/%D0%A1%D0%B8%D1%81%D1%82%D0%B5%D0%BC%D0%B0%20%D0%BD%D0%B0%D1%86%D0%B8%D0%BE%D…
requires: Услуга коллективного потребления
term status: draft
broader: Фактическое конечное потребление
definition: Actual final consumption of general government is measured by the value of the collective consumption services provided to the community, or large sections of the community, by general government.
definition: Фактическое конечное потребление сектора государственного управления определяется как стоимость услуг коллективного потребления, предоставленных сектором государственного управления обществу в целом или большим частям общества.
in scheme: Глоссарий
preferred label: Actual Final Consumption of General Government
related: Товары
related: Расходы на конечное потребление
related: Социальные трансферты в натуральной форме
related: Домашнее хозяйство
related: Услуги
top concept of: Глоссарий

Акции и паи фондов денежного рынка
type: Concept
comment: Акции фондов денежного рынка иногда функционально близки к переводимым депозитам, например, к чековым счетам с неограниченными привилегиями. Если акции этих фондов включены в стране в категорию денег в широком определении, они должны отражаться как отдельная статья, чтобы обеспечить согласованность с денежно-кредитной статистикой.
source: Система национальных счетов 2008
  source: https://stat.semanticpro.org/xwiki/wiki/NationalAccounts/view/%D0%91%D0%B8%D0%B1%D0%BB%D0%B8%D0%BE%D1%82%D0%B5%D0%BA%D0%B0/%D0%A1%D0%B8%D1%81%D1%82%D0%B5%D0%BC%D0%B0%20%D0%BD%D0%B0%D1%86%D0%B8%D0%BE%D…
requires: Актив
requires: Фонды денежного рынка
term status: draft
definition: Money market fund shares or units represent a claim on a proportion of the value of an established money market fund.
definition: Акции и паи фондов денежного рынка представляют собой требование на часть стоимости чистых активов учрежденного фонда денежного рынка.
in scheme: Глоссарий
preferred label: Money Market Fund Shares or Units
related: Переводимые депозиты
top concept of: Глоссарий

Нефинансовые корпорации
type: Concept
comment: Сектор нефинансовых корпораций состоит из следующей совокупности резидентских институциональных единиц: все резидентские нефинансовые корпорации (как они определены в СНС, а не только <a target="_blank" rel="noopener noreferrer" href="https://stat.semanticpro.org/xwiki/wiki/NationalAccounts/view/%D0%93%D0%BB%D0%BE%D1%81%D1%81%D0%B0%D1%80%D0%B8%D0%B8/%D0%9A%D0%BE%D1%80%D0%BF%D0%BE%D1%80%D0%B0%D1%86%D0%B8%D1%8F%2C%20%D1%83%D1%87%D1%80%D0%B5%D0%B6%D0%B4%D0%B5%D0%BD%D0%BD%D0%B0%D1%8F%20%D0%BA%D0%B0%D0%BA%20%D1%8E%D1%80%D0%B8%D0%B4%D0%B8%D1%87%D0%B5%D1%81%D0%BA%D0%BE%D0%B5%20%D0%BB%D0%B8%D1%86%D0%BE/">корпорации, учрежденные как юридические лица) независимо от резидентства их акционеров; филиалы нерезидентских предприятий, которые заняты нефинансовой производственной деятельностью на экономической территории данной страны в течение длительного периода времени; все резидентские НКО, которые являются рыночными производителями товаров или нефинансовых услуг.
requires: Товары
requires: Корпорация
requires: Производство
requires: Услуги
term status: draft
broader: Институциональный сектор
definition: Non-financial corporations are corporations whose principal activity is the production of market goods or non-financial services.
definition: Нефинансовые корпорации — это корпорации, основным видом деятельности которых является производство рыночных товаров или нефинансовых услуг.
in scheme: Глоссарий
preferred label: Non-financial corporations
related: Предприятие
related: Товары
related: Институциональная единица
related: Рыночные производители
related: Корпорация, учрежденная как юридическое лицо
related: Производство
related: Услуги
related: Резидентство
related: Некоммерческие организации
top concept of: Глоссарий

Субсидии на производство, подлежащие получению
type: Concept
comment: Существуют только два основных вида расходов, которые производители должны вычесть из добавленной стоимости, а именно - оплата труда, подлежащая выплате наемным работникам за их участие в производстве, и любые суммы налогов на производство за вычетом субсидий, подлежащих выплате органам государственного управления.
source: Система национальных счетов 2008
  source: https://stat.semanticpro.org/xwiki/wiki/NationalAccounts/view/%D0%91%D0%B8%D0%B1%D0%BB%D0%B8%D0%BE%D1%82%D0%B5%D0%BA%D0%B0/%D0%A1%D0%B8%D1%81%D1%82%D0%B5%D0%BC%D0%B0%20%D0%BD%D0%B0%D1%86%D0%B8%D0%BE%D…
requires: Другие субсидии на производство
requires: Субсидия на продукт
requires: Рабочая сила
requires: Выпуск
requires: Актив
requires: Производство
term status: draft
definition: Субсидии на производство, подлежащие получению, включают субсидии на продукты, производимые в качестве выпуска, а также другие субсидии на производство, выплачиваемые в связи с использованием в производстве рабочей силы, машин, зданий и других активов.
definition: Subsidies on production consist of subsidies receivable on goods or services produced as outputs and other subsidies on production, such as those payable on the labour, machinery, buildings or other assets used in production.
in scheme: Глоссарий
preferred label: Subsidies on production
related: Оплата труда
related: Налоги
related: Субсидии
related: Органы государственного управления
related: Производство
top concept of: Глоссарий

Изменение чистой стоимости капитала вследствие номинальных холдинговых прибылей/убытков
type: Concept
comment: Изменение стоимости чистого капитала вследствие номинальных холдинговых прибылей может быть подразделено на изменение чистой стоимости капитала вследствие нейтральных холдинговых прибылей или убытков и изменение чистой стоимости капитала вследствие реальных холдинговых прибылей или убытков.
source: Система национальных счетов 2008
  source: https://stat.semanticpro.org/xwiki/wiki/NationalAccounts/view/%D0%91%D0%B8%D0%B1%D0%BB%D0%B8%D0%BE%D1%82%D0%B5%D0%BA%D0%B0/%D0%A1%D0%B8%D1%81%D1%82%D0%B5%D0%BC%D0%B0%20%D0%BD%D0%B0%D1%86%D0%B8%D0%BE%D…
requires: Институциональная единица
requires: Обязательство
requires: Актив
term status: draft
definition: Changes in net worth due to nominal holding gains/losses is defined as the algebraic sum of the positive or negative nominal holding gains on all the assets and liabilities of an institutional unit.
definition: Изменение чистой стоимости капитала вследствие номинальных холдинговых прибылей/убытков определяется как алгебраическая сумма положительных или отрицательных номинальных холдинговых прибылей на все активы и обязательства институциональной единицы.
in scheme: Глоссарий
preferred label: Changes in net Worth Due to Nominal Holding Gains/Losses
related: Чистая стоимость капитала
top concept of: Глоссарий

Другое незавершенное производство
type: Concept
comment: Незавершенное производство подразделяется на <a target="_blank" rel="noopener noreferrer" href="https://stat.semanticpro.org/xwiki/wiki/NationalAccounts/view/%D0%93%D0%BB%D0%BE%D1%81%D1%81%D0%B0%D1%80%D0%B8%D0%B8/%D0%9D%D0%B5%D0%B7%D0%B0%D0%B2%D0%B5%D1%80%D1%88%D0%B5%D0%BD%D0%BD%D0%BE%D0%B5%20%D0%BF%D1%80%D0%BE%D0%B8%D0%B7%D0%B2%D0%BE%D0%B4%D1%81%D1%82%D0%B2%D0%BE%20%D0%BA%D1%83%D0%BB%D1%8C%D1%82%D0%B8%D0%B2%D0%B8%D1%80%D1%83%D0%B5%D0%BC%D1%8B%D1%85%20%D0%B1%D0%B8%D0%BE%D0%BB%D0%BE%D0%B3%D0%B8%D1%87%D0%B5%D1%81%D0%BA%D0%B8%D1%85%20%D1%80%D0%B5%D1%81%D1%83%D1%80%D1%81%D0%BE%D0%B2/">незавершенное производство культивируемых биологических ресурсов и на другое незавершенное производство.
source: Система национальных счетов 2008
  source: https://stat.semanticpro.org/xwiki/wiki/NationalAccounts/view/%D0%91%D0%B8%D0%B1%D0%BB%D0%B8%D0%BE%D1%82%D0%B5%D0%BA%D0%B0/%D0%A1%D0%B8%D1%81%D1%82%D0%B5%D0%BC%D0%B0%20%D0%BD%D0%B0%D1%86%D0%B8%D0%BE%D…
requires: Продукты
requires: Культивируемые биологические ресурсы
requires: Институциональная единица
requires: Выпуск
term status: draft
broader: Незавершенное производство
definition: Другое незавершенное производство состоит из выпуска продукции (кроме культивируемых биологических ресурсов), которая еще недостаточно обработана, чтобы быть в том состоянии, в котором она обычно поставляется другим институциональным единицам.
definition: Other work-in-progress consists of output (other than on cultivated biological resources) that is not yet sufficiently processed to be in a state in which it is normally supplied to other institutional units.
in scheme: Глоссарий
preferred label: Other Work-in-Progress
related: Незавершенное производство культивируемых биологических ресурсов
related: Незавершенное производство
top concept of: Глоссарий

Программа с определенной величиной пособий
type: Concept
source: Система национальных счетов 2008
  source: https://stat.semanticpro.org/xwiki/wiki/NationalAccounts/view/%D0%91%D0%B8%D0%B1%D0%BB%D0%B8%D0%BE%D1%82%D0%B5%D0%BA%D0%B0/%D0%A1%D0%B8%D1%81%D1%82%D0%B5%D0%BC%D0%B0%20%D0%BD%D0%B0%D1%86%D0%B8%D0%BE%D…
term status: draft
definition: Программа с определенной величиной пособий — это программа, в соответствии с которой пособия, подлежащие выплате наемному работнику в связи с уходом на пенсию, определяются путем использования формулы или путем установления минимальной суммы, подлежащей выплате.
definition: A defined benefit scheme is one where the benefits payable to an employee on retirement are determined by the use of a formula, either alone or as a minimum amount payable.
in scheme: Глоссарий
preferred label: Defined Benefit Scheme
top concept of: Глоссарий

Страховые корпорации
type: Concept
comment: Captive insurance is included, that is, an insurance company that serves only its owners. Deposit insurers, issuers of deposit guarantees and other issuers of standardized guarantees that are separate entities and act like insurers by charging premiums and have reserves, are classified as insurance corporations.
comment: Кэптивное страхование включено, то есть страховые корпорации, которые обслуживают только их владельцев. К страховым корпорациям относятся страховщики депозитов, компании, предоставляющие гарантии по депозитам, и другие компании, предоставляющие стандартизированные гарантии, которые являются отдельными юридическими лицами, действуют как страховщики, получая страховые премии, и имеют резервы.
source: Система национальных счетов 2008
  source: https://stat.semanticpro.org/xwiki/wiki/NationalAccounts/view/%D0%91%D0%B8%D0%B1%D0%BB%D0%B8%D0%BE%D1%82%D0%B5%D0%BA%D0%B0/%D0%A1%D0%B8%D1%81%D1%82%D0%B5%D0%BC%D0%B0%20%D0%BD%D0%B0%D1%86%D0%B8%D0%BE%D…
requires: Институциональная единица
requires: Страхование жизни
requires: Услуги
term status: draft
definition: Страховые корпорации включают корпорированные единицы, взаимные фонды и другие единицы, основная функция которых состоит в предоставлении услуг по страхованию жизни, страхованию от несчастных случаев, болезни, пожаров или по другим формам страхования отдельным институциональным единицам или группам единиц или услуг перестрахования другим страховым корпорациям.
definition: Insurance corporations consist of incorporated, mutual and other entities whose principal function is to provide life, accident, sickness, fire or other forms of insurance to individual institutional units or groups of units or reinsurance services to other insurance corporations.
in scheme: Глоссарий
preferred label: Insurance Corporations
related: Юридическое лицо
top concept of: Глоссарий

Выпуск для собственного конечного использования
type: Concept
comment: Стоимость выпуска для собственного конечного использования определяется как сумма следующих статей: стоимость товаров, произведенных некорпорированным предприятием домашнего хозяйства и потребленных тем же самым домашним хозяйством стоимость услуг, предоставленных домашнему хозяйству наемной оплачиваемой прислугой стоимость условно исчисленных жилищных услуг, произведенных владельцами жилищ для собственного потребления стоимость основных фондов, произведенных заведением для собственного использования, которые остаются на том же предприятии для использования в будущем производстве (валовое накопление основного капитала) стоимость изменения запасов готовых продуктов и незавершенного производства, предназначенных для различных видов использования, упомянутых выше в исключительных случаях, которые описаны ниже в этом разделе, выпуск, использованный для собственного промежуточного потребления.
source: Система национальных счетов 2008
  source: https://stat.semanticpro.org/xwiki/wiki/NationalAccounts/view/%D0%91%D0%B8%D0%B1%D0%BB%D0%B8%D0%BE%D1%82%D0%B5%D0%BA%D0%B0/%D0%A1%D0%B8%D1%81%D1%82%D0%B5%D0%BC%D0%B0%20%D0%BD%D0%B0%D1%86%D0%B8%D0%BE%D…
requires: Продукты
requires: Потребление
term status: draft
definition: Output for own final use consists of products retained by the producer for his own use as final consumption or capital formation.
definition: Выпуск для собственного конечного использования включает продукты, используемые производителем для его собственного конечного потребления или накопления.
in scheme: Глоссарий
preferred label: Output for Own Final Use
related: Предприятие
related: Валовое накопление основного капитала
related: Запасы
related: Промежуточное потребление
related: Незавершенное производство
related: Выпуск
related: Услуги
related: Производство
related: Заведение
related: Продукты
related: Товары
related: Потребление
related: Домашнее хозяйство
top concept of: Глоссарий

Акции, не включенные в листинг
type: Concept
comment: Акции, не включенные в листинг, можно также назвать частным акционерным капиталом; обычно эту форму принимает венчурный капитал. Акции, не включенные в листинг, обычно выпускаются дочерними компаниями и малыми предприятиями, и в отношении них обычно применяются различные регулирующие требования, но никакие ограничения не являются обязательными для их идентификации.
source: Система национальных счетов 2008
  source: https://stat.semanticpro.org/xwiki/wiki/NationalAccounts/view/%D0%91%D0%B8%D0%B1%D0%BB%D0%B8%D0%BE%D1%82%D0%B5%D0%BA%D0%B0/%D0%A1%D0%B8%D1%81%D1%82%D0%B5%D0%BC%D0%B0%20%D0%BD%D0%B0%D1%86%D0%B8%D0%BE%D…
requires: Ценные бумаги
term status: draft
preferred label: Unlisted Shares
definition: Unlisted shares are equity securities not listed on an exchange.
definition: Акции, не включенные в листинг — это ценные бумаги в форме акций, не зарегистрированные на фондовой бирже.
in scheme: Глоссарий
related: Предприятие
related: Акционерный капитал
top concept of: Глоссарий

Наличная валюта
type: Concept
source: Система национальных счетов 2008
  source: https://stat.semanticpro.org/xwiki/wiki/NationalAccounts/view/%D0%91%D0%B8%D0%B1%D0%BB%D0%B8%D0%BE%D1%82%D0%B5%D0%BA%D0%B0/%D0%A1%D0%B8%D1%81%D1%82%D0%B5%D0%BC%D0%B0%20%D0%BD%D0%B0%D1%86%D0%B8%D0%BE%D…
requires: Центральный банк
requires: Органы государственного управления
term status: draft
definition: Currency consists of notes and coins that are of fixed nominal values and are issued or authorized by the central bank or government.
definition: Наличная валюта включает банкноты и монеты, которые имеют фиксированную номинальную стоимость и выпущены или разрешены к выпуску центральным банком или органами государственного управления.
in scheme: Глоссарий
preferred label: Currency
top concept of: Глоссарий

Права на получение выплат по страхованию жизни и аннуитетам
type: Concept
comment: Единственной операцией, отражаемой в финансовом счете для прав на получение выплат по страхованию жизни и аннуитетам, является разница между чистыми страховыми премиями, подлежащими получению, и страховыми возмещениями, подлежащими выплате.
comment: The only transaction for life insurance and annuity entitlements recorded in the financial account is the difference between net premiums receivable and claims payable.
source: Система национальных счетов 2008
  source: https://stat.semanticpro.org/xwiki/wiki/NationalAccounts/view/%D0%91%D0%B8%D0%B1%D0%BB%D0%B8%D0%BE%D1%82%D0%B5%D0%BA%D0%B0/%D0%A1%D0%B8%D1%81%D1%82%D0%B5%D0%BC%D0%B0%20%D0%BD%D0%B0%D1%86%D0%B8%D0%BE%D…
requires: Предприятие
requires: Финансовое требование
requires: Страхование жизни
requires: Услуги
term status: draft
definition: Life insurance and annuities entitlements show the extent of financial claims policyholders have against an enterprise offering life insurance or providing annuities.
definition: Права на получение выплат по страхованию жизни и аннуитетам отражают объем финансовых требований держателей полисов к предприятию, предоставляющему услуги по страхованию жизни или выплате аннуитетов.
in scheme: Глоссарий
preferred label: Life Insurance and Annuities Entitlements
related: Чистые страховые премии
related: Страховое возмещение
related: Операция
top concept of: Глоссарий

Водные ресурсы
type: Concept
comment: Если не представляется возможным отделить стоимость поверхностных вод от связанной с ними земли, весь актив должен быть отнесен к категории, представляющей большую часть общей величины.
source: Система национальных счетов 2008
  source: https://stat.semanticpro.org/xwiki/wiki/NationalAccounts/view/%D0%91%D0%B8%D0%B1%D0%BB%D0%B8%D0%BE%D1%82%D0%B5%D0%BA%D0%B0/%D0%A1%D0%B8%D1%81%D1%82%D0%B5%D0%BC%D0%B0%20%D0%BD%D0%B0%D1%86%D0%B8%D0%BE%D…
term status: draft
definition: Водные ресурсы состоят из ресурсов поверхностных и грунтовых вод, используемых для извлечения, в той мере, в которой их ограниченность требует обеспечения прав собственности и/или прав использования, рыночной оценки и некоторых мер экономического контроля.
definition: Water resources consist of surface and groundwater resources used for extraction to the extent that their scarcity leads to the enforcement of ownership and/or use rights, market valuation and some measure of economic control.
in scheme: Глоссарий
preferred label: Water Resources
related: Земля
related: Актив
top concept of: Глоссарий

Реализованная холдинговая прибыль
type: Concept
source: Система национальных счетов 2008
  source: https://stat.semanticpro.org/xwiki/wiki/NationalAccounts/view/%D0%91%D0%B8%D0%B1%D0%BB%D0%B8%D0%BE%D1%82%D0%B5%D0%BA%D0%B0/%D0%A1%D0%B8%D1%81%D1%82%D0%B5%D0%BC%D0%B0%20%D0%BD%D0%B0%D1%86%D0%B8%D0%BE%D…
requires: Обязательство
requires: Актив
term status: draft
definition: Реализованная холдинговая прибыль. Холдинговая прибыль (убыток) реализована, когда актив, стоимость которого увеличилась (уменьшилась) вследствие холдинговых прибылей (убытков) с начала отчетного периода, продан, выкуплен или использован иным образом, или обязательство, стоимость которого включает холдинговые прибыли или убытки, оплачено.
definition: A holding gain (loss) is realized when an asset that has increased (decreased) in value due to holding gains (losses) since the beginning of the accounting period is sold, redeemed, used or otherwise disposed of, or a liability incorporating a holding gain or loss is repaid. An unrealized holding gain is one accruing on an asset that is still owned or a liability that is still outstanding at the end of the accounting period.
in scheme: Глоссарий
preferred label: Holding Gain
top concept of: Глоссарий

Чистая добавленная стоимость
type: Concept
comment: Поскольку добавленная стоимость предназначена для измерения стоимости, созданной в процессе производства, она должна быть измерена на чистой основе, так как потребление основного капитала представляет собой статью затрат на производство.
source: Система национальных счетов 2008
  source: https://stat.semanticpro.org/xwiki/wiki/NationalAccounts/view/%D0%91%D0%B8%D0%B1%D0%BB%D0%B8%D0%BE%D1%82%D0%B5%D0%BA%D0%B0/%D0%A1%D0%B8%D1%81%D1%82%D0%B5%D0%BC%D0%B0%20%D0%BD%D0%B0%D1%86%D0%B8%D0%BE%D…
requires: Потребление основного капитала
requires: Промежуточное потребление
requires: Выпуск
term status: draft
definition: Чистая добавленная стоимость — стоимости выпуска минус стоимость промежуточного потребления и потребления основного капитала
definition: Net value added is the value of output less the values of both intermediate consumption and consumption of fixed capital.
in scheme: Глоссарий
preferred label: Net value added
related: Потребление основного капитала
related: Производство
top concept of: Глоссарий

Другие финансовые посредники, кроме страховых корпораций и пенсионных фондов
type: Concept
comment: It is a feature of a financial intermediary that transactions on both sides of the balance sheet are carried out in open markets
comment: Характерная особенность финансового посредничества состоит в том, что операции, отражающиеся на обеих сторонах баланса активов и пассивов, осуществляются на открытых рынках.
source: Система национальных счетов 2008
  source: https://stat.semanticpro.org/xwiki/wiki/NationalAccounts/view/%D0%91%D0%B8%D0%B1%D0%BB%D0%B8%D0%BE%D1%82%D0%B5%D0%BA%D0%B0/%D0%A1%D0%B8%D1%81%D1%82%D0%B5%D0%BC%D0%B0%20%D0%BD%D0%B0%D1%86%D0%B8%D0%BE%D…
requires: Финансовые корпорации
requires: Финансовые активы
requires: Операция
requires: Обязательство
requires: Услуги
term status: draft
definition: Other financial intermediaries except insurance corporations and pension funds consist of financial corporations that are engaged in providing financial services by incurring liabilities, in forms other than currency, deposits or close substitutes for deposits, on their own account for the purpose of acquiring financial assets by engaging in financial transactions on the market.
definition: Другие финансовые посредники, кроме страховых корпораций и пенсионных фондов, включают финансовые корпорации, которые заняты предоставлением от своего имени финансовых услуг путем принятия обязательств в форме, отличной от денег, депозитов или близких аналогов депозитов, с целью приобретения финансовых активов, участвуя в финансовых операциях на рынке.
in scheme: Глоссарий
preferred label: Other Financial Intermediaries
related: Баланс активов и пассивов
related: Операция
top concept of: Глоссарий

Неденежные операции
type: Concept
source: Система национальных счетов 2008
  source: https://stat.semanticpro.org/xwiki/wiki/NationalAccounts/view/%D0%91%D0%B8%D0%B1%D0%BB%D0%B8%D0%BE%D1%82%D0%B5%D0%BA%D0%B0/%D0%A1%D0%B8%D1%81%D1%82%D0%B5%D0%BC%D0%B0%20%D0%BD%D0%B0%D1%86%D0%B8%D0%BE%D…
requires: Операция
term status: draft
broader: Операция
definition: Non-monetary transactions are transactions that are not initially stated in units of currency.
definition: Неденежные операции — это операции, которые изначально не выражены в денежных единицах.
in scheme: Глоссарий
preferred label: Non-monetary transactions
top concept of: Глоссарий

Фактическое конечное потребление домашних хозяйств
type: Concept
comment: Фактическое конечное потребление домашних хозяйств состоит из потребительских товаров и услуг, приобретенных отдельными домашними хозяйствами. Стоимость фактического конечного потребления домашних хозяйств определяется суммой трех компонентов: a. Стоимость расходов домашних хозяйств на потребительские товары или услуги, включая расходы на нерыночные товары или услуги, проданные по ценам, которые не являются экономически значимыми; b. Стоимость расходов, которые осуществляют единицы сектора государственного управления на <a target="_blank" rel="noopener noreferrer" href="https://stat.semanticpro.org/xwiki/wiki/NationalAccounts/view/%D0%93%D0%BB%D0%BE%D1%81%D1%81%D0%B0%D1%80%D0%B8%D0%B8/%D0%A2%D0%BE%D0%B2%D0%B0%D1%80%D1%8B%20%D0%B8%D0%BB%D0%B8%20%D1%83%D1%81%D0%BB%D1%83%D0%B3%D0%B8%20%D0%B8%D0%BD%D0%B4%D0%B8%D0%B2%D0%B8%D0%B4%D1%83%D0%B0%D0%BB%D1%8C%D0%BD%D0%BE%D0%B3%D0%BE%20%D0%BF%D0%BE%D1%82%D1%80%D0%B5%D0%B1%D0%BB%D0%B5%D0%BD%D0%B8%D1%8F/">товары или услуги индивидуального потребления, предоставляемые домашним хозяйствам в качестве <a target="_blank" rel="noopener noreferrer" href="https://stat.semanticpro.org/xwiki/wiki/NationalAccounts/view/%D0%93%D0%BB%D0%BE%D1%81%D1%81%D0%B0%D1%80%D0%B8%D0%B8/%D0%A1%D0%BE%D1%86%D0%B8%D0%B0%D0%BB%D1%8C%D0%BD%D1%8B%D0%B5%20%D1%82%D1%80%D0%B0%D0%BD%D1%81%D1%84%D0%B5%D1%80%D1%82%D1%8B%20%D0%B2%20%D0%BD%D0%B0%D1%82%D1%83%D1%80%D0%B0%D0%BB%D1%8C%D0%BD%D0%BE%D0%B9%20%D1%84%D0%BE%D1%80%D0%BC%D0%B5/">социальных трансфертов в натуральной форме; и c. Стоимость расходов, которые осуществляют <a target="_blank" rel="noopener noreferrer" href="https://stat.semanticpro.org/xwiki/wiki/NationalAccounts/view/%D0%93%D0%BB%D0%BE%D1%81%D1%81%D0%B0%D1%80%D0%B8%D0%B8/%D0%9D%D0%B5%D0%BA%D0%BE%D0%BC%D0%BC%D0%B5%D1%80%D1%87%D0%B5%D1%81%D0%BA%D0%B8%D0%B5%20%D0%BE%D1%80%D0%B3%D0%B0%D0%BD%D0%B8%D0%B7%D0%B0%D1%86%D0%B8%D0%B8%2C%20%D0%BE%D0%B1%D1%81%D0%BB%D1%83%D0%B6%D0%B8%D0%B2%D0%B0%D1%8E%D1%89%D0%B8%D0%B5%20%D0%B4%D0%BE%D0%BC%D0%B0%D1%88%D0%BD%D0%B8%D0%B5…
source: Система национальных счетов 2008
  source: https://stat.semanticpro.org/xwiki/wiki/NationalAccounts/view/%D0%91%D0%B8%D0%B1%D0%BB%D0%B8%D0%BE%D1%82%D0%B5%D0%BA%D0%B0/%D0%A1%D0%B8%D1%81%D1%82%D0%B5%D0%BC%D0%B0%20%D0%BD%D0%B0%D1%86%D0%B8%D0%BE%D…
requires: Товары
requires: Домашнее хозяйство
requires: Потребление
requires: Услуги
term status: draft
broader: Фактическое конечное потребление
definition: Actual final consumption of households is measured by the value of all the individual consumption goods and services acquired by resident households.
definition: Фактическое конечное потребление домашних хозяйств определяется как стоимость всех товаров и услуг индивидуального потребления, приобретенных домашними хозяйствами — резидентами данной страны.
in scheme: Глоссарий
preferred label: Actual Final Consumption of Households
related: Товары или услуги индивидуального потребления
related: Некоммерческие организации, обслуживающие домашние хозяйства
related: Цена
related: Товары
related: Социальные трансферты в натуральной форме
related: Домашнее хозяйство
related: Услуги
related: Потребительские товары и услуги
top concept of: Глоссарий

Пособие по социальному страхованию
type: Concept
source: Система национальных счетов 2008
  source: https://stat.semanticpro.org/xwiki/wiki/NationalAccounts/view/%D0%91%D0%B8%D0%B1%D0%BB%D0%B8%D0%BE%D1%82%D0%B5%D0%BA%D0%B0/%D0%A1%D0%B8%D1%81%D1%82%D0%B5%D0%BC%D0%B0%20%D0%BD%D0%B0%D1%86%D0%B8%D0%BE%D…
requires: Программа социального страхования
requires: Социальные пособия
term status: draft
broader: Социальные пособия
definition: Пособие по социальному страхованию — это социальное пособие, подлежащее выплате в силу того, что его получатель участвует в программе социального страхования и в связи с наступлением социального риска, против которого он был застрахован.
definition: A social insurance contribution is the amount payable to a social insurance scheme in order for a designated beneficiary to be entitled to receive the social benefits covered by the scheme.
in scheme: Глоссарий
preferred label: Social Insurance Contribution
top concept of: Глоссарий

Другие налоги на производство
type: Concept
comment: Такие налоги не включают никаких налогов на прибыль или другие доходы, получаемые предприятием, и подлежат уплате независимо от рентабельности производства. Объектом налогообложения может являться земля, основные фонды или рабочая сила, используемые в производстве, либо определенные виды деятельности и операций.
comment: Such taxes do not include any taxes on the profits or other income received by the enterprise and are payable regardless of the profitability of the production. They may be payable on the land, fixed assets or labour employed in the production process or on certain activities or transactions.
source: Система национальных счетов 2008
  source: https://stat.semanticpro.org/xwiki/wiki/NationalAccounts/view/%D0%91%D0%B8%D0%B1%D0%BB%D0%B8%D0%BE%D1%82%D0%B5%D0%BA%D0%B0/%D0%A1%D0%B8%D1%81%D1%82%D0%B5%D0%BC%D0%B0%20%D0%BD%D0%B0%D1%86%D0%B8%D0%BE%D…
requires: Предприятие
requires: Налоги
requires: Налог на продукт
requires: Производство
term status: draft
broader: Налоги
definition: Other taxes on production consist of all taxes except taxes on products that enterprises incur as a result of engaging in production.
definition: Другие налоги на производство включают все налоги, кроме налогов на продукты, которые подлежат выплате предприятиями в результате их участия в производстве.
in scheme: Глоссарий
preferred label: Other Taxes on Production
related: Предприятие
related: Налоги
related: Рабочая сила
related: Земля
related: Операция
related: Основные фонды
related: Производство
top concept of: Глоссарий

Торговая наценка
type: Concept
comment: The margins realized on some goods may be negative if their prices have to be marked down. They must also be negative on goods that are never sold because they go to waste or are stolen.
comment: Торговые наценки на некоторые товары могут быть отрицательными, если их цены были снижены. Они также должны быть отрицательными на товары, которые никогда не были проданы ввиду их порчи или хищения.
source: Система национальных счетов 2008
  source: https://stat.semanticpro.org/xwiki/wiki/NationalAccounts/view/%D0%91%D0%B8%D0%B1%D0%BB%D0%B8%D0%BE%D1%82%D0%B5%D0%BA%D0%B0/%D0%A1%D0%B8%D1%81%D1%82%D0%B5%D0%BC%D0%B0%20%D0%BD%D0%B0%D1%86%D0%B8%D0%BE%D…
requires: Предприятие
requires: Цена
requires: Товары
term status: draft
definition: Торговая наценка определяется как разница между фактической или условно исчисленной ценой, полученной в результате реализации товара, приобретенного для перепродажи, и ценой, которую предприятию торговли пришлось бы заплатить, чтобы приобрести идентичный товар (для замены проданного) на момент, когда он был продан или использован каким-либо другим способом.
definition: A trade margin is defined as the difference between the actual or imputed price realized on a good purchased for resale and the price that would have to be paid by the distributor to replace the good at the time it is sold or otherwise disposed of.
in scheme: Глоссарий
preferred label: Trade Margin
related: Цена
related: Товары
top concept of: Глоссарий

Другие переводимые депозиты
type: Concept
source: Система национальных счетов 2008
  source: https://stat.semanticpro.org/xwiki/wiki/NationalAccounts/view/%D0%91%D0%B8%D0%B1%D0%BB%D0%B8%D0%BE%D1%82%D0%B5%D0%BA%D0%B0/%D0%A1%D0%B8%D1%81%D1%82%D0%B5%D0%BC%D0%B0%20%D0%BD%D0%B0%D1%86%D0%B8%D0%BE%D…
requires: Операция
requires: Переводимые депозиты
term status: draft
definition: Другие переводимые депозиты являются такими переводимыми депозитами, в операциях с которыми одна сторона или обе стороны, то есть либо кредитор, либо дебитор, или оба они, не являются банками.
definition: Other transferable deposits are those where one party or both parties to the transaction, or either the creditor or debtor or both of the positions, is not a bank.
in scheme: Глоссарий
preferred label: Other Transferable Deposits
top concept of: Глоссарий

Нерыночный выпуск
type: Concept
comment: Хотя этот выпуск отражается как приобретенный органами государственного управления и <a target="_blank" rel="noopener noreferrer" href="https://stat.semanticpro.org/xwiki/wiki/NationalAccounts/view/%D0%93%D0%BB%D0%BE%D1%81%D1%81%D0%B0%D1%80%D0%B8%D0%B8/%D0%9D%D0%B5%D0%BA%D0%BE%D0%BC%D0%BC%D0%B5%D1%80%D1%87%D0%B5%D1%81%D0%BA%D0%B8%D0%B5%20%D0%BE%D1%80%D0%B3%D0%B0%D0%BD%D0%B8%D0%B7%D0%B0%D1%86%D0%B8%D0%B8%2C%20%D0%BE%D0%B1%D1%81%D0%BB%D1%83%D0%B6%D0%B8%D0%B2%D0%B0%D1%8E%D1%89%D0%B8%D0%B5%20%D0%B4%D0%BE%D0%BC%D0%B0%D1%88%D0%BD%D0%B8%D0%B5%20%D1%85%D0%BE%D0%B7%D1%8F%D0%B9%D1%81%D1%82%D0%B2%D0%B0/">НКОДХ в счетах использования доходов, он не может рассматриваться как производство для собственного использования. Расходы производятся органами государственного управления и <a target="_blank" rel="noopener noreferrer" href="https://stat.semanticpro.org/xwiki/wiki/NationalAccounts/view/%D0%93%D0%BB%D0%BE%D1%81%D1%81%D0%B0%D1%80%D0%B8%D0%B8/%D0%9D%D0%B5%D0%BA%D0%BE%D0%BC%D0%BC%D0%B5%D1%80%D1%87%D0%B5%D1%81%D0%BA%D0%B8%D0%B5%20%D0%BE%D1%80%D0%B3%D0%B0%D0%BD%D0%B8%D0%B7%D0%B0%D1%86%D0%B8%D0%B8%2C%20%D0%BE%D0%B1%D1%81%D0%BB%D1%83%D0%B6%D0%B8%D0%B2%D0%B0%D1%8E%D1%89%D0%B8%D0%B5%20%D0%B4%D0%BE%D0%BC%D0%B0%D1%88%D0%BD%D0%B8%D0%B5%20%D1%85%D0%BE%D0%B7%D1%8F%D0%B9%D1%81%D1%82%D0%B2%D0%B0/">НКОДХ, но использование индивидуальных товаров и услуг осуществляется домашними хозяйствами, а использование коллективных услуг осуществляется обществом в целом. Таким образом, нерыночный выпуск никогда не должен рассматриваться как выпуск, произведенный для собственного использования, при отражении которого не только производится условное исчисление расходов производителя на выпуск, но также считается, что производитель фактически использует выпуск.
source: Система национальных счетов 2008
  source: https://stat.semanticpro.org/xwiki/wiki/NationalAccounts/view/%D0%91%D0%B8%D0%B1%D0%BB%D0%B8%D0%BE%D1%82%D0%B5%D0%BA%D0%B0/%D0%A1%D0%B8%D1%81%D1%82%D0%B5%D0%BC%D0%B0%20%D0%BD%D0%B0%D1%86%D0%B8%D0%BE%D…
requires: Некоммерческие организации, обслуживающие домашние хозяйства
requires: Цена
requires: Товары
requires: Органы государственного управления
requires: Услуги
term status: draft
broader: Выпуск
definition: Non-market output consists of goods and individual or collective services produced by non-profit institutions serving households (NPISHs) or government that are supplied free, or at prices that are not economically significant, to other institutional units or the community as a whole.
definition: Нерыночный выпуск включает товары и индивидуальные или коллективные услуги, произведенные <a target="_blank" rel="noopener noreferrer" href="https://stat.semanticpro.org/xwiki/wiki/NationalAccounts/view/%D0%93%D0%BB%D0%BE%D1%81%D1%81%D0%B0%D1%80%D0%B8%D0%B8/%D0%9D%D0%B5%D0%BA%D0%BE%D0%BC%D0%BC%D0%B5%D1%80%D1%87%D0%B5%D1%81%D0%BA%D0%B8%D0%B5%20%D0%BE%D1%80%D0%B3%D0%B0%D0%BD%D0%B8%D0%B7%D0%B0%D1%86%D0%B8%D0%B8%2C%20%D0%BE%D0%B1%D1%81%D0%BB%D1%83%D0%B6%D0%B8%D0%B2%D0%B0%D1%8E%D1%89%D0%B8%D0%B5%20%D0%B4%D0%BE%D0%BC%D0%B0%D1%88%D0%BD%D0%B8%D0%B5%20%D1%85%D0%BE%D0%B7%D1%8F%D0%B9%D1%81%D1%82%D0%B2%D0%B0/">некоммерческими организациями, обслуживающими домашние хозяйства (<a target="_blank" rel="noopener noreferrer" href="https://stat.semanticpro.org/xwiki/wiki/NationalAccounts/view/%D0%93%D0%BB%D0%BE%D1%81%D1%81%D0%B0%D1%80%D0%B8%D0%B8/%D0%9D%D0%B5%D0%BA%D0%BE%D0%BC%D0%BC%D0%B5%D1%80%D1%87%D0%B5%D1%81%D0%BA%D0%B8%D0%B5%20%D0%BE%D1%80%D0%B3%D0%B0%D0%BD%D0%B8%D0%B7%D0%B0%D1%86%D0%B8%D0%B8%2C%20%D0%BE%D0%B1%D1%81%D0%BB%D1%83%D0%B6%D0%B8%D0%B2%D0%B0%D1%8E%D1%89%D0%B8%D0%B5%20%D0%B4%D0%BE%D0%BC%D0%B0%D1%88%D0%BD%D0%B8%D0%B5%20%D1%85%D0%BE%D0%B7%D1%8F%D0%B9%D1%81%D1%82%D0%B2%D0%B0/">НКОДХ), или органами государственного управления, которые предоставляются другим институциональным единицам или обществу в целом бесплатно или по экономически незначимым ценам.
in scheme: Глоссарий
preferred label: Non-Market Output
related: Некоммерческие организации, обслуживающие домашние хозяйства
related: Товары
related: Выпуск
related: Домашнее хозяйство
related: Органы государственного управления
related: Производство
related: Услуги
top concept of: Глоссарий

Текущие трансферты между домашними хозяйствами
type: Concept
comment: Трансферты включают все трансферты в денежной форме и стоимость трансфертов в натуральной форме. В случае денежных переводов текущие трансферты между домашними хозяйствами обычно относятся к персональным трансфертам.
source: Система национальных счетов 2008
  source: https://stat.semanticpro.org/xwiki/wiki/NationalAccounts/view/%D0%91%D0%B8%D0%B1%D0%BB%D0%B8%D0%BE%D1%82%D0%B5%D0%BA%D0%B0/%D0%A1%D0%B8%D1%81%D1%82%D0%B5%D0%BC%D0%B0%20%D0%BD%D0%B0%D1%86%D0%B8%D0%BE%D…
requires: Текущий трансферт
requires: Домашнее хозяйство
term status: draft
broader: Текущий трансферт
definition: Current transfers between households consist of all current transfers made, or received, by resident households to or from other resident or non-resident households.
definition: Текущие трансферты между домашними хозяйствами включают все текущие трансферты, произведенные домашними хозяйствами-резидентами данной страны другим домашним хозяйствам — резидентам или нерезидентам, или, соответственно, все текущие трансферты, полученные домашними хозяйствами-резидентами данной страны от других домашних хозяйств, как резидентов, так и нерезидентов.
in scheme: Глоссарий
preferred label: Current Transfers Between Households
related: Трансферт
top concept of: Глоссарий

Чистый внутренний продукт
type: Concept
source: Система национальных счетов 2008
  source: https://stat.semanticpro.org/xwiki/wiki/NationalAccounts/view/%D0%91%D0%B8%D0%B1%D0%BB%D0%B8%D0%BE%D1%82%D0%B5%D0%BA%D0%B0/%D0%A1%D0%B8%D1%81%D1%82%D0%B5%D0%BC%D0%B0%20%D0%BD%D0%B0%D1%86%D0%B8%D0%BE%D…
requires: Потребление основного капитала
requires: Валовый внутренний продукт
term status: draft
alternative label: Net domestic product (NDP)
alternative label: ЧВП
definition: Net domestic product (NDP) is defined as gross domestic product (GDP) less the consumption of fixed capital.
definition: Чистый внутренний продукт (ЧВП) определяется как валовой внутренний продукт (ВВП) минус потребление основного капитала.
in scheme: Глоссарий
preferred label: Net Domestic Product
top concept of: Глоссарий

Первичные доходы
type: Concept
comment: Основной статьей первичных доходов является оплата труда, которая представляет собой доход, получаемый отдельными лицами в качестве вознаграждения за их затраты труда в процессе производства.
source: Система национальных счетов 2008
  source: https://stat.semanticpro.org/xwiki/wiki/NationalAccounts/view/%D0%91%D0%B8%D0%B1%D0%BB%D0%B8%D0%BE%D1%82%D0%B5%D0%BA%D0%B0/%D0%A1%D0%B8%D1%81%D1%82%D0%B5%D0%BC%D0%B0%20%D0%BD%D0%B0%D1%86%D0%B8%D0%BE%D…
requires: Институциональная единица
requires: Актив
requires: Производство
term status: draft
definition: Primary incomes are incomes that accrue to institutional units as a consequence of their involvement in processes of production or ownership of assets that may be needed for purposes of production.
definition: Первичные доходы — это доходы, получаемые институциональными единицами в результате их участия в производственных процессах или владения активами, которые могут использоваться для целей производства.
in scheme: Глоссарий
preferred label: Primary Incomes
related: Оплата труда
related: Производство
top concept of: Глоссарий

Экономически значимые цены
type: Concept
comment: These prices normally result when: (a) the producer has an incentive to adjust supply either with the goal of making a profit in the long run or, at a minimum, covering capital and other costs and (b) consumers have the freedom to purchase or not purchase and make the choice on the basis of the prices charged.
comment: Эти цены обычно складываются, когда: a) у производителя есть стимул скорректировать поставку продуктов с целью получения прибыли в долгосрочной перспективе или, как минимум, возмещения затрат капитала и других расходов; и b) у потребителей есть свобода в принятии решения покупать или не покупать, и они делают этот выбор на основе запрашиваемых цен.
source: Система национальных счетов 2008
  source: https://stat.semanticpro.org/xwiki/wiki/NationalAccounts/view/%D0%91%D0%B8%D0%B1%D0%BB%D0%B8%D0%BE%D1%82%D0%B5%D0%BA%D0%B0/%D0%A1%D0%B8%D1%81%D1%82%D0%B5%D0%BC%D0%B0%20%D0%BD%D0%B0%D1%86%D0%B8%D0%BE%D…
requires: Цена
requires: Продукты
term status: draft
definition: Экономически значимые цены — это цены, которые оказывают существенное влияние на количества продуктов, которые производители хотят поставить, и на количества продуктов, которые покупатели хотят приобрести.
definition: Economically significant prices are prices that have a significant effect on the amounts that producers are willing to supply and on the amounts purchasers wish to buy.
in scheme: Глоссарий
preferred label: Economically Significant Prices
related: Цена
related: Продукты
top concept of: Глоссарий

Компьютерное программное обеспечение
type: Concept
comment: Валовое накопление основного капитала в форме компьютерного программного обеспечения включает как начальную разработку, так и последующие расширения программного обеспечения, а также приобретение копий, которые классифицируются как активы. Разработка компьютерного программного обеспечения представляет собой разработку продукта интеллектуальной собственности. Оно отражается как актив, если будет использоваться его собственником в производстве более одного года. Программное обеспечение может быть предназначено только для собственного использования разработчиком или может быть предназначено на продажу с помощью распространения копий.
source: Система национальных счетов 2008
  source: https://stat.semanticpro.org/xwiki/wiki/NationalAccounts/view/%D0%91%D0%B8%D0%B1%D0%BB%D0%B8%D0%BE%D1%82%D0%B5%D0%BA%D0%B0/%D0%A1%D0%B8%D1%81%D1%82%D0%B5%D0%BC%D0%B0%20%D0%BD%D0%B0%D1%86%D0%B8%D0%BE%D…
term status: draft
definition: Computer software consists of computer programs, program descriptions and supporting materials for both systems and applications software.
definition: Компьютерное программное обеспечение состоит из компьютерных программ, описаний программ и вспомогательных материалов как для компьютерных систем, так и для прикладного программного обеспечения.
in scheme: Глоссарий
preferred label: Computer Software
related: Валовое накопление основного капитала
related: Продукты
related: Актив
related: Производство
top concept of: Глоссарий

Доход от собственности
type: Concept
comment: Property income accrues when the owners of financial assets and natural resources put them at the disposal of other institutional units.
comment: Доходы от собственности начисляются, когда собственники финансовых активов и природных ресурсов передают их в распоряжение другим институциональным единицам.
source: Система национальных счетов 2008
  source: https://stat.semanticpro.org/xwiki/wiki/NationalAccounts/view/%D0%91%D0%B8%D0%B1%D0%BB%D0%B8%D0%BE%D1%82%D0%B5%D0%BA%D0%B0/%D0%A1%D0%B8%D1%81%D1%82%D0%B5%D0%BC%D0%B0%20%D0%BD%D0%B0%D1%86%D0%B8%D0%BE%D…
requires: Инвестиционный доход
requires: Рента
term status: draft
definition: Property income is the sum of investment income and rent.
definition: Доход от собственности — это сумма инвестиционного дохода и ренты.
in scheme: Глоссарий
preferred label: Property Income
related: Институциональная единица
related: Финансовые активы
related: Природные ресурсы
top concept of: Глоссарий

Природные ресурсы
type: Concept
source: Система национальных счетов 2008
  source: https://stat.semanticpro.org/xwiki/wiki/NationalAccounts/view/%D0%91%D0%B8%D0%B1%D0%BB%D0%B8%D0%BE%D1%82%D0%B5%D0%BA%D0%B0/%D0%A1%D0%B8%D1%81%D1%82%D0%B5%D0%BC%D0%B0%20%D0%BD%D0%B0%D1%86%D0%B8%D0%BE%D…
requires: Водные ресурсы
requires: Земля
term status: draft
broader: Непроизведенные активы
definition: Природные ресурсы представляют собой ресурсы естественного происхождения, такие как земля, водные ресурсы, дикорастущие леса и ресурсы полезных ископаемых, имеющие экономическую стоимость.
definition: Natural resources consist of naturally occurring resources such as land, water resources, uncultivated forests and deposits of minerals that have an economic value.
in scheme: Глоссарий
preferred label: Natural Resources
top concept of: Глоссарий

Резидентство
type: Concept
requires: Институциональная единица
term status: draft
definition: Резидентство каждой институциональной единицы — это экономическая территория, с которой она имеет наиболее тесную связь, другими словами, на которой находится центр ее преобладающего экономического интереса.
definition: The residence of each institutional unit is the economic territory with which it has the strongest connection, in other words, its centre of predominant economic interest.
in scheme: Глоссарий
preferred label: Residence
top concept of: Глоссарий

Чистый национальный доход
type: Concept
source: Система национальных счетов 2008
  source: https://stat.semanticpro.org/xwiki/wiki/NationalAccounts/view/%D0%91%D0%B8%D0%B1%D0%BB%D0%B8%D0%BE%D1%82%D0%B5%D0%BA%D0%B0/%D0%A1%D0%B8%D1%81%D1%82%D0%B5%D0%BC%D0%B0%20%D0%BD%D0%B0%D1%86%D0%B8%D0%BE%D…
requires: Потребление основного капитала
requires: Валовой национальный доход
term status: draft
alternative label: Net National Income (NNI)
alternative label: ЧНД
definition: Net national income (NNI) is defined as GNI less the consumption of fixed capital.
definition: Чистый национальный доход (ЧНД) определяется как валовой национальный доход (ВНД) минус потребление основного капитала.
in scheme: Глоссарий
preferred label: Net National Income
top concept of: Глоссарий

Акции и паи других инвестиционных фондов
type: Concept
source: Система национальных счетов 2008
  source: https://stat.semanticpro.org/xwiki/wiki/NationalAccounts/view/%D0%91%D0%B8%D0%B1%D0%BB%D0%B8%D0%BE%D1%82%D0%B5%D0%BA%D0%B0/%D0%A1%D0%B8%D1%81%D1%82%D0%B5%D0%BC%D0%B0%20%D0%BD%D0%B0%D1%86%D0%B8%D0%BE%D…
requires: Инвестиционные фонды
requires: Фонды денежного рынка
term status: draft
definition: Other investment fund shares or units represent a claim on a proportion of the value of an established investment fund other than a money market fund.
definition: Акции и паи других инвестиционных фондов представляют собой требование на часть стоимости чистых активов учрежденного инвестиционного фонда за исключением фондов денежного рынка.
in scheme: Глоссарий
preferred label: Other Investment Fund Shares or Units
top concept of: Глоссарий

Некоммерческие организации
type: Concept
comment: На практике их производственная деятельность должна создавать либо доход, либо убыток, но любой доход, который они могут получить, не может быть присвоен другими институциональными единицами. Устав организации, в соответствии с которым они учреждены, сформулирован таким образом, что институциональные единицы, которые их контролируют или управляют ими, не имеют права на получение доли в любых прибылях или других доходах, которые они получают. По этой причине они нередко освобождены от уплаты налогов.
requires: Товары
requires: Юридическое лицо
requires: Производство
requires: Услуги
term status: draft
alternative label: НКО
broader: Институциональный сектор
definition: Non-profit institutions (NPIs) are legal or social entities created for the purpose of producing goods and services but whose status does not permit them to be a source of income, profit or other financial gain for the units that establish, control or finance them.
definition: Некоммерческие организации (НКО) — это юридические лица или общественные организации, создаваемые с целью производства товаров и услуг, чей статус не позволяет им быть источником дохода, прибыли или другой финансовой выгоды для единиц, которые их учреждают, контролируют или финансируют.
in scheme: Глоссарий
preferred label: Non-profit institutions
related: Налоги
related: Институциональная единица
related: Производство
top concept of: Глоссарий

Договор аренды природных ресурсов
type: Concept
comment: Договор аренды природных ресурсов может относиться к любому природному ресурсу, определенному как актив в СНС. Для таких ресурсов, как земля, предполагается, что после окончания договора аренды природных ресурсов, земля возвращается юридическому собственнику в таком же состоянии, в котором она была при заключении договора. Такие ресурсы, как запасы полезных ископаемых, хотя они теоретически имеют неограниченный срок службы, но возвращаются юридическому собственнику по окончании аренды не полностью, так как цель аренды заключается в разрешении извлекать и использовать ресурсы. Хотя ресурс может истощиться даже с учетом открытия новых месторождений и проведения переоценок (или естественного пополнения воз обновляемых ресурсов), тот факт, что рента отражается без вычета любого потребления природных ресурсов, означает, что в СНС ресурсы рассматриваются как имеющие неограниченный срок службы с точки зрения образования доходов.Природный ресурс продолжает учитываться в балансе активов и пассивов арендодателя, даже если он используется арендополучателем. По договоренности никакое уменьшение стоимости природного ресурса не отражается в СНС как операция, аналогичная потреблению основного капитала.
source: Система национальных счетов 2008
  source: https://stat.semanticpro.org/xwiki/wiki/NationalAccounts/view/%D0%91%D0%B8%D0%B1%D0%BB%D0%B8%D0%BE%D1%82%D0%B5%D0%BA%D0%B0/%D0%A1%D0%B8%D1%81%D1%82%D0%B5%D0%BC%D0%B0%20%D0%BD%D0%B0%D1%86%D0%B8%D0%BE%D…
requires: Юридический собственник
requires: Рента
requires: Природные ресурсы
requires: Доход от собственности
term status: draft
definition: Договор аренды природных ресурсов — это соглашение, в соответствии с которым юридический собственник природного ресурса, который в СНС рассматривается как имеющий неопределенный срок существования, предоставляет его арендополучателю за регулярную плату, отражаемую как доход от собственности в форме ренты.
definition: A resource lease is an agreement whereby the legal owner of a natural resource that the SNA treats as having an infinite life makes it available to a lessee in return for a regular payment recorded as property income and described as rent.
in scheme: Глоссарий
preferred label: Resource Lease
related: Баланс активов и пассивов
related: Запасы
related: Земля
related: Операция
related: Потребление
related: Юридический собственник
related: Рента
related: Актив
related: Природные ресурсы
top concept of: Глоссарий

Денежная операция
type: Concept
comment: В СНС все потоки отражаются в денежной форме, но отличительной характеристикой денежной операции является то, что стороны операции формулируют их соглашение в денежной форме. Например, товар приобретается или продается за определенное число денежных единиц за единицу товара или труд предоставляется по найму за определенное количество денежных единиц в расчете за час или день.
source: Система национальных счетов 2008
  source: https://stat.semanticpro.org/xwiki/wiki/NationalAccounts/view/%D0%91%D0%B8%D0%B1%D0%BB%D0%B8%D0%BE%D1%82%D0%B5%D0%BA%D0%B0/%D0%A1%D0%B8%D1%81%D1%82%D0%B5%D0%BC%D0%B0%20%D0%BD%D0%B0%D1%86%D0%B8%D0%BE%D…
requires: Институциональная единица
requires: Обязательство
requires: Актив
term status: draft
broader: Операция
definition: Денежная операция — это такая операция, в которой одна институциональная единица производит платеж (получает платеж) или принимает обязательство (приобретает актив), выраженная в денежных единицах.
definition: A monetary transaction is one in which one institutional unit makes a payment (receives a payment) or incurs a liability (receives an asset) stated in units of currency.
in scheme: Глоссарий
preferred label: Monetary transaction
related: Товары
related: Операция
top concept of: Глоссарий

Балансирующая статья
type: Concept
comment: Балансирующая статья имеется также в балансе активов и пассивов, где она представляет собой разницу между активами и обязательствами и называется чистой стоимостью капитала.
source: Система национальных счетов 2008
  source: https://stat.semanticpro.org/xwiki/wiki/NationalAccounts/view/%D0%91%D0%B8%D0%B1%D0%BB%D0%B8%D0%BE%D1%82%D0%B5%D0%BA%D0%B0/%D0%A1%D0%B8%D1%81%D1%82%D0%B5%D0%BC%D0%B0%20%D0%BD%D0%B0%D1%86%D0%B8%D0%BE%D…
requires: Обязательство
requires: Актив
term status: draft
definition: Балансирующая статья — это конструкция национального счетоводства, получаемая путем вычитания из общей суммы записей на одной стороне счета (ресурсы или изменения в обязательствах) общей суммы записей на другой стороне (использование или изменения в активах). Она не может быть измерена независимо от записей в счетах; полученная балансовым методом (сальдированием), она отражает применение общих правил ведения счетов к конкретным записям на двух сторонах счета.
definition: A balancing item is an accounting construct obtained by subtracting the total value of the entries on one side of an account (resources or changes in liabilities) from the total value of the entries on the other side (uses or changes in assets). It cannot be measured independently of the entries in the accounts; as a derived entry, it reflects the application of the general accounting rules to the specific entries on the two sides of the account.
in scheme: Глоссарий
preferred label: Balancing item
related: Баланс активов и пассивов
related: Чистая стоимость капитала
related: Обязательство
related: Актив
top concept of: Глоссарий

Валютно-процентный своп
type: Concept
comment: Расчеты часто производятся чистыми наличными платежами одной стороны сделки другой стороне.
comment: Settlements are often made through net cash payments by one counterparty to the other.
source: Система национальных счетов 2008
  source: https://stat.semanticpro.org/xwiki/wiki/NationalAccounts/view/%D0%91%D0%B8%D0%B1%D0%BB%D0%B8%D0%BE%D1%82%D0%B5%D0%BA%D0%B0/%D0%A1%D0%B8%D1%81%D1%82%D0%B5%D0%BC%D0%B0%20%D0%BD%D0%B0%D1%86%D0%B8%D0%BE%D…
source: Система национальных счетов 2008
  source: https://stat.semanticpro.org/xwiki/wiki/NationalAccounts/view/%D0%91%D0%B8%D0%B1%D0%BB%D0%B8%D0%BE%D1%82%D0%B5%D0%BA%D0%B0/%D0%A1%D0%B8%D1%81%D1%82%D0%B5%D0%BC%D0%B0%20%D0%BD%D0%B0%D1%86%D0%B8%D0%BE%D…
term status: draft
alternative label: Валютный своп
definition: Валютно-процентный своп, иногда называемый валютным свопом, представляет собой обмен потоками процентных платежей в разных валютах и обмен основными суммами по согласованному обменному курсу в конце действия контракта.
definition: Процентный своп предусматривает обмен процентными платежами в одной и той же валюте в течение определенного периода времени, исчисляемыми на условную основную сумму, которая никогда не перечисляется.
definition: An interest rate swap contract involves an exchange of cash flows related to interest payments, or receipts, on a notional amount of principal, which is never exchanged, in one currency over a period of time.
in scheme: Глоссарий
preferred label: Interest Rate Swap
preferred label: Процентный своп
top concept of: Глоссарий

Производство
type: Concept
comment: Счёт производства показывает выпуск произведенной продукции и различные затраты на производство.
source: Система национальных счетов 2008
  source: https://stat.semanticpro.org/xwiki/wiki/NationalAccounts/view/%D0%91%D0%B8%D0%B1%D0%BB%D0%B8%D0%BE%D1%82%D0%B5%D0%BA%D0%B0/%D0%A1%D0%B8%D1%81%D1%82%D0%B5%D0%BC%D0%B0%20%D0%BD%D0%B0%D1%86%D0%B8%D0%BE%D…
requires: Товары
requires: Институциональная единица
requires: Услуги
term status: draft
alternative label: Производственная деятельность
definition: Производство — вид деятельности, осуществляемый под ответственностью, контролем и управлением институциональной единицы, которая использует труд, капитал и товары и услуги для производства товаров и услуг.
definition: Production is an activity, carried out under the responsibility, control and management of an institutional unit, that uses inputs of labour, capital, and goods and services to produce outputs of goods and services.
in scheme: Глоссарий
preferred label: Production
related: Продукты
related: Выпуск
top concept of: Глоссарий

Сбережение
type: Concept
comment: Сбережение может быть положительным или отрицательным в зависимости от того, превышает ли располагаемый доход расходы на конечное потребление или наоборот. Предполагая, что сбережение положительно (и что нет капитальных трансфертов), неистраченный доход должен использоваться на приобретение активов (возможно, только на увеличение денежных средств) или на сокращение обязательств. Если сбережение отрицательно, то некоторые финансовые или нефинансовые активы должны были быть реализованы или использованы каким-либо другим способом (включая сокращение денежных средств), или некоторые обязательства должны были увеличиться.
source: Система национальных счетов 2008
  source: https://stat.semanticpro.org/xwiki/wiki/NationalAccounts/view/%D0%91%D0%B8%D0%B1%D0%BB%D0%B8%D0%BE%D1%82%D0%B5%D0%BA%D0%B0/%D0%A1%D0%B8%D1%81%D1%82%D0%B5%D0%BC%D0%B0%20%D0%BD%D0%B0%D1%86%D0%B8%D0%BE%D…
requires: Товары
requires: Располагаемый доход
requires: Потребление
requires: Услуги
term status: draft
definition: Saving represents that part of disposable income (adjusted for the change in pension entitlements) that is not spent on final consumption goods and services.
definition: Сбережение представляет собой ту часть располагаемого дохода (скорректированного на изменение в пенсионных правах), которая не потрачена на товары и услуги для конечного потребления.
in scheme: Глоссарий
preferred label: Saving
related: Располагаемый доход
related: Расходы на конечное потребление
related: Обязательство
related: Капитальные трансферты
related: Актив
top concept of: Глоссарий

Валовая добавленная стоимость
type: Concept
comment: Поскольку добавленная стоимость предназначена для измерения стоимости, созданной в процессе производства, она должна быть измерена на чистой основе, так как потребление основного капитала представляет собой статью затрат на производство. Однако, как пояснено ниже, на практике трудно измерить потребление основного капитала и не всегда можно получить удовлетворительные оценки его стоимости и, следовательно, чистой добавленной стоимости. Поэтому предусмотрена возможность измерения добавленной стоимости как на валовой, так и на чистой основе.
source: Система национальных счетов 2008
  source: https://stat.semanticpro.org/xwiki/wiki/NationalAccounts/view/%D0%91%D0%B8%D0%B1%D0%BB%D0%B8%D0%BE%D1%82%D0%B5%D0%BA%D0%B0/%D0%A1%D0%B8%D1%81%D1%82%D0%B5%D0%BC%D0%B0%20%D0%BD%D0%B0%D1%86%D0%B8%D0%BE%D…
requires: Промежуточное потребление
requires: Выпуск
term status: draft
definition: Gross value added is the value of output less the value of intermediate consumption.
definition: Валовая добавленная стоимость — стоимость выпуска минус стоимость промежуточного потребления.
in scheme: Глоссарий
preferred label: Gross Value Added
related: Потребление основного капитала
related: Чистая добавленная стоимость
related: Производство
top concept of: Глоссарий

Корпорация, учрежденная как юридическое лицо
type: Concept
comment: Корпорации, учрежденные как юридические лица, могут фигурировать под различными наименования ми: корпорации, инкорпорированные предприятия, государственные компании с ограниченной ответственностью, партнерства с ограниченной ответственностью и т. д. Законы, регламентирующие создание, управление и операции корпораций, учрежденных как юридические лица, могут варьироваться от страны к стране, и поэтому невозможно дать точное юридическое определение корпорации, которое имело бы универсальный характер.
source: Система национальных счетов 2008
  source: https://stat.semanticpro.org/xwiki/wiki/NationalAccounts/view/%D0%91%D0%B8%D0%B1%D0%BB%D0%B8%D0%BE%D1%82%D0%B5%D0%BA%D0%B0/%D0%A1%D0%B8%D1%81%D1%82%D0%B5%D0%BC%D0%B0%20%D0%BD%D0%B0%D1%86%D0%B8%D0%BE%D…
requires: Товары
requires: Корпорация
requires: Юридическое лицо
requires: Услуги
requires: Производство
term status: draft
broader: Корпорация
broader: Юридическое лицо
definition: Корпорация, учрежденная как юридическое лицо, представляет собой юридическое лицо, созданное с целью производства товаров или услуг для продажи их на рынке, которое может быть источником прибыли или других финансовых выгод для ее собственника (собственников). Она находится в коллективной собственности акционеров, которые имеют полномочия назначать директоров, ответственных за общее управление корпорацией.
definition: A legally constituted corporation is a legal entity, created for the purpose of producing goods or services for the market, that may be a source of profit or other financial gain to its owner(s). It is collectively owned by shareholders who have the authority to appoint directors responsible for its general management.
in scheme: Глоссарий
preferred label: Legally Constituted Corporation
related: Предприятие
related: Корпорация
related: Операция
top concept of: Глоссарий

Научные исследования и разработки
type: Concept
source: Система национальных счетов 2008
  source: https://stat.semanticpro.org/xwiki/wiki/NationalAccounts/view/%D0%91%D0%B8%D0%B1%D0%BB%D0%B8%D0%BE%D1%82%D0%B5%D0%BA%D0%B0/%D0%A1%D0%B8%D1%81%D1%82%D0%B5%D0%BC%D0%B0%20%D0%BD%D0%B0%D1%86%D0%B8%D0%BE%D…
requires: Запасы
requires: Актив
term status: draft
definition: Научные исследования и разработки включают расходы на творческую работу, осуществляемую на систематической основе с целью увеличения запаса знаний, включая знания о человеке, культуре и обществе, и использования этого запаса знаний для разработки новых возможностей его применения. Это не предполагает включение человеческого капитала в состав активов в СНС.
definition: Research and development consists of the value of expenditures on creative work undertaken on a systematic basis in order to increase the stock of knowledge, including knowledge of man, culture and society, and use of this stock of knowledge to devise new applications. This does not extend to including human capital as assets within the SNA.
in scheme: Глоссарий
preferred label: Research and Development Consists
top concept of: Глоссарий

Центральный банк
type: Concept
source: Система национальных счетов 2008
  source: https://stat.semanticpro.org/xwiki/wiki/NationalAccounts/view/%D0%91%D0%B8%D0%B1%D0%BB%D0%B8%D0%BE%D1%82%D0%B5%D0%BA%D0%B0/%D0%A1%D0%B8%D1%81%D1%82%D0%B5%D0%BC%D0%B0%20%D0%BD%D0%B0%D1%86%D0%B8%D0%BE%D…
term status: draft
definition: The central bank is the national financial institution that exercises control over key aspects of the financial system.
definition: Центральный банк — это национальное финансовое учреждение, которое осуществляет контроль над ключевыми аспектами финансовой системы.
in scheme: Глоссарий
preferred label: Central Bank
top concept of: Глоссарий

Кэптивные финансовые учреждения и ростовщики
type: Concept
comment: Они включают единицы, которые осуществляют операции только в рамках ограниченной группы единиц (таких, как дочерние финансовые корпорации), или дочерние корпорации, принадлежащие одной и той же холдинговой корпорации, или единицы, которые предоставляют ссуду из собственных средств, предоставленных только одним спонсором.
source: Система национальных счетов 2008
  source: https://stat.semanticpro.org/xwiki/wiki/NationalAccounts/view/%D0%91%D0%B8%D0%B1%D0%BB%D0%B8%D0%BE%D1%82%D0%B5%D0%BA%D0%B0/%D0%A1%D0%B8%D1%81%D1%82%D0%B5%D0%BC%D0%B0%20%D0%BD%D0%B0%D1%86%D0%B8%D0%BE%D…
requires: Институциональная единица
requires: Операция
requires: Обязательство
requires: Актив
requires: Услуги
term status: draft
definition: Кэптивные финансовые учреждения и ростовщики включают институциональные единицы, предоставляющие финансовые услуги, у которых большая часть активов или обязательств не участвует в операциях на открытых финансовых рынках.
definition: Captive financial institutions and money lenders consist of institutional units providing financial services, where most of either their assets or liabilities are not transacted on open financial markets.
in scheme: Глоссарий
preferred label: Captive Financial Institutions and Money Lenders
related: Финансовые корпорации
related: Корпорация
related: Операция
related: Ссуды
top concept of: Глоссарий

Экономически активное население
type: Concept
source: Система национальных счетов 2008
  source: https://stat.semanticpro.org/xwiki/wiki/NationalAccounts/view/%D0%91%D0%B8%D0%B1%D0%BB%D0%B8%D0%BE%D1%82%D0%B5%D0%BA%D0%B0/%D0%A1%D0%B8%D1%81%D1%82%D0%B5%D0%BC%D0%B0%20%D0%BD%D0%B0%D1%86%D0%B8%D0%BE%D…
requires: Границы сферы производства в СНС
term status: draft
definition: The economically active population is defined in terms of individuals willing to supply labour to undertake an activity included in the SNA production boundary.
definition: Экономически активное население — это физические лица, желающие предоставить свой труд для занятия деятельностью, включенной в границы сферы производства в СНС.
in scheme: Глоссарий
preferred label: Economically Active Population
top concept of: Глоссарий

Соглашение о продаже ценных бумаг
type: Concept
comment: Предоставление ценных бумаг взаймы под залог наличных денег и продажа ценных бумаг с обратной покупкой с экономической точки зрения являются такой же сделкой, как и соглашение о продаже ценных бумаг с последующим выкупом; все эти операции предполагают предоставление ценных бумаг как форму обеспечения ссуды или депозита.
comment: Securities lending with cash collateral and sale/buy-backs are economically the same as a repurchase agreement; all involve the provision of securities as collateral for a loan or deposit.
source: Система национальных счетов 2008
  source: https://stat.semanticpro.org/xwiki/wiki/NationalAccounts/view/%D0%91%D0%B8%D0%B1%D0%BB%D0%B8%D0%BE%D1%82%D0%B5%D0%BA%D0%B0/%D0%A1%D0%B8%D1%81%D1%82%D0%B5%D0%BC%D0%B0%20%D0%BD%D0%B0%D1%86%D0%B8%D0%BE%D…
requires: Цена
requires: Ценные бумаги
requires: Обязательство
term status: draft
definition: A securities repurchase agreement is an arrangement involving the provision of securities in exchange for cash with a commitment to repurchase the same or similar securities at a fixed price either on a specified future date (often one or a few days hence, but also further in the future) or with an “open” maturity.
definition: Соглашение о продаже ценных бумаг с последующим выкупом является сделкой, в которой ценные бумаги предоставляются в обмен на наличные деньги с обязательством выкупить те же или аналогичные ценные бумаги по фиксированной цене в определенную дату в будущем (обычно через один или несколько дней, но также и в более поздний срок) или с «открытым» сроком выкупа.
in scheme: Глоссарий
preferred label: Securities Repurchase Agreement
related: Ценные бумаги
related: Операция
related: Ссуды
top concept of: Глоссарий

Сырье и материалы
type: Concept
comment: Не все материалы неизбежно поступают в производство, поскольку некоторые из них могут быть потеряны в результате физической деградации, случайного повреждения или хищения. Такие потери сырья и материалов отражаются и оцениваются таким же образом, как сырье и материалы, фактически изъятые из запасов для расходования в производстве.
comment: Not all necessarily get used in this way, however, as some may be lost as a result of physical deterioration, or recurrent accidental damage or pilfering. Such losses of materials and supplies are recorded and valued in the same way as materials and supplies actually withdrawn to be used up in production.
source: Система национальных счетов 2008
  source: https://stat.semanticpro.org/xwiki/wiki/NationalAccounts/view/%D0%91%D0%B8%D0%B1%D0%BB%D0%B8%D0%BE%D1%82%D0%B5%D0%BA%D0%B0/%D0%A1%D0%B8%D1%81%D1%82%D0%B5%D0%BC%D0%B0%20%D0%BD%D0%B0%D1%86%D0%B8%D0%BE%D…
requires: Предприятие
requires: Продукты
requires: Материальные оборотные средства
requires: Запасы
requires: Промежуточное потребление
requires: Производство
term status: draft
definition: Materials and supplies consist of all products that an enterprise holds in inventory with the intention of using them as intermediate inputs into production.
definition: Сырье и материалы включают все продукты, которые находятся у предприятия в запасах материальных оборотных средств и которые оно предполагает использовать в качестве промежуточного потребления в производстве.
in scheme: Глоссарий
preferred label: Materials and Supplies
related: Запасы
related: Производство
top concept of: Глоссарий

Фактическая страховая премия
type: Concept
source: Система национальных счетов 2008
  source: https://stat.semanticpro.org/xwiki/wiki/NationalAccounts/view/%D0%91%D0%B8%D0%B1%D0%BB%D0%B8%D0%BE%D1%82%D0%B5%D0%BA%D0%B0/%D0%A1%D0%B8%D1%81%D1%82%D0%B5%D0%BC%D0%B0%20%D0%BD%D0%B0%D1%86%D0%B8%D0%BE%D…
term status: draft
definition: Фактическая страховая премия — это сумма, подлежащая выплате прямому страховщику или перестраховщику, предназначенная для обеспечения страхования рисков в отношении конкретного случая в течение определенного периода времени.
definition: The actual premium is the amount payable to the direct insurer or reinsurer to secure insurance cover for a specific event over a stated time period.
in scheme: Глоссарий
preferred label: Actual Premium
top concept of: Глоссарий

Системы вооружения
type: Concept
comment: Most single-use weapons they deliver, such as ammunition, missiles, rockets, bombs, etc., are treated as military inventories. However, some single-use items, such as certain types of ballistic missile with a highly destructive capability, may provide an ongoing service of deterrence against aggressors and therefore meet the general criteria for classification as fixed assets.
comment: Большинство оружия одноразового использования, такого как боеприпасы, снаряды, ракеты, бомбы и т. д., отражается в счетах как <a target="_blank" rel="noopener noreferrer" href="https://stat.semanticpro.org/xwiki/wiki/NationalAccounts/view/%D0%93%D0%BB%D0%BE%D1%81%D1%81%D0%B0%D1%80%D0%B8%D0%B8/%D0%9C%D0%B0%D1%82%D0%B5%D1%80%D0%B8%D0%B0%D0%BB%D1%8C%D0%BD%D1%8B%D0%B5%20%D0%BE%D0%B1%D0%BE%D1%80%D0%BE%D1%82%D0%BD%D1%8B%D0%B5%20%D1%81%D1%80%D0%B5%D0%B4%D1%81%D1%82%D0%B2%D0%B0%20%D0%B2%D0%BE%D0%B5%D0%BD%D0%BD%D0%BE%D0%B3%D0%BE%20%D0%BD%D0%B0%D0%B7%D0%BD%D0%B0%D1%87%D0%B5%D0%BD%D0%B8%D1%8F/">материальные оборотные средства военного назначения. Однако некоторые объекты одноразового использования, такие как некоторые виды баллистических ракет с высокой разрушительной способностью, могут использоваться для сдерживания агрессоров в течение длительного периода времени и поэтому соответствуют общим критериям классификации в качестве основных фондов.
source: Система национальных счетов 2008
  source: https://stat.semanticpro.org/xwiki/wiki/NationalAccounts/view/%D0%91%D0%B8%D0%B1%D0%BB%D0%B8%D0%BE%D1%82%D0%B5%D0%BA%D0%B0/%D0%A1%D0%B8%D1%81%D1%82%D0%B5%D0%BC%D0%B0%20%D0%BD%D0%B0%D1%86%D0%B8%D0%BE%D…
term status: draft
definition: Weapons systems include vehicles and other equipment such as warships, submarines, military aircraft, tanks, missile carriers and launchers, etc.
definition: Системы вооружения включают транспортные средства и другие виды оборудования, такие как военные корабли, подводные лодки, военные самолеты, танки, ракетные носители и системы запуска и т.д.
in scheme: Глоссарий
preferred label: Weapons Systems
related: Материальные оборотные средства военного назначения
top concept of: Глоссарий

Валовое накопление основного капитала
type: Concept
comment: In order to ensure that the coverage of gross fixed capital formation is precisely defined, it is necessary first to define what does and what does not constitute a fixed asset and what activities are treated as adding to the value of non-produced assets.
comment: С целью точного определения охвата валового накопления основного капитала необходимо сначала установить, что относится и что не относится к основным фондам, и какая деятельность, увеличивающая стоимость непроизведенных активов, отражается в счетах как элемент валового накопления основного капитала.
source: Система национальных счетов 2008
  source: https://stat.semanticpro.org/xwiki/wiki/NationalAccounts/view/%D0%91%D0%B8%D0%B1%D0%BB%D0%B8%D0%BE%D1%82%D0%B5%D0%BA%D0%B0/%D0%A1%D0%B8%D1%81%D1%82%D0%B5%D0%BC%D0%B0%20%D0%BD%D0%B0%D1%86%D0%B8%D0%BE%D…
requires: Непроизведенные активы
requires: Услуги
term status: draft
preferred label: Gross Fixed Capital Formation
broader: Валовое накопление
definition: Gross fixed capital formation is measured by the total value of a producer’s acquisitions, less disposals, of fixed assets during the accounting period plus certain specified expenditure on services that adds to the value of non-produced assets.
definition: Валовое накопление основного капитала определяется как общая стоимость приобретения производителем основных фондов (за вычетом их выбытия) в течение отчетного периода плюс некоторые расходы на услуги, которые увеличивают стоимость непроизведенных активов.
in scheme: Глоссарий
related: Актив
top concept of: Глоссарий

Располагаемый доход
type: Concept
source: Система национальных счетов 2008
  source: https://stat.semanticpro.org/xwiki/wiki/NationalAccounts/view/%D0%91%D0%B8%D0%B1%D0%BB%D0%B8%D0%BE%D1%82%D0%B5%D0%BA%D0%B0/%D0%A1%D0%B8%D1%81%D1%82%D0%B5%D0%BC%D0%B0%20%D0%BD%D0%B0%D1%86%D0%B8%D0%BE%D…
requires: Институциональный сектор
requires: Институциональная единица
requires: Социальные трансферты в натуральной форме
requires: Текущий трансферт
requires: Сальдо первичных доходов
requires: Балансирующая статья
term status: draft
definition: Disposable income is the balancing item in the secondary distribution of income account. It is derived from the balance of primary incomes of an institutional unit or sector by adding all current transfers, except social transfers in kind, receivable by that unit or sector and subtracting all current transfers, except social transfers in kind, payable by that unit or sector.
definition: Располагаемый доход представляет собой балансирующую статью счета вторичного распределения доходов. Он исчисляется с помощью внесения ряда коррективов (добавлений и вычитаний) к сальдо первичных доходов институциональной единицы или институционального сектора, а именно, путем добавления всех текущих трансфертов, за исключением <a target="_blank" rel="noopener noreferrer" href="https://stat.semanticpro.org/xwiki/wiki/NationalAccounts/view/%D0%93%D0%BB%D0%BE%D1%81%D1%81%D0%B0%D1%80%D0%B8%D0%B8/%D0%A1%D0%BE%D1%86%D0%B8%D0%B0%D0%BB%D1%8C%D0%BD%D1%8B%D0%B5%20%D1%82%D1%80%D0%B0%D0%BD%D1%81%D1%84%D0%B5%D1%80%D1%82%D1%8B%20%D0%B2%20%D0%BD%D0%B0%D1%82%D1%83%D1%80%D0%B0%D0%BB%D1%8C%D0%BD%D0%BE%D0%B9%20%D1%84%D0%BE%D1%80%D0%BC%D0%B5/">социальных трансфертов в натуральной форме, подлежащих получению этой единицей или этим сектором, и вычитания всех текущих трансфертов, кроме <a target="_blank" rel="noopener noreferrer" href="https://stat.semanticpro.org/xwiki/wiki/NationalAccounts/view/%D0%93%D0%BB%D0%BE%D1%81%D1%81%D0%B0%D1%80%D0%B8%D0%B8/%D0%A1%D0%BE%D1%86%D0%B8%D0%B0%D0%BB%D1%8C%D0%BD%D1%8B%D0%B5%20%D1%82%D1%80%D0%B0%D0%BD%D1%81%D1%84%D0%B5%D1%80%D1%82%D1%8B%20%D0%B2%20%D0%BD%D0%B0%D1%82%D1%83%D1%80%D0%B0%D0%BB%D1%8C%D0%BD%D0%BE%D0%B9%20%D1%84%D0%BE%D1%80%D0%BC%D0%B5/">социальных трансфертов в натуральной форме, подлежащих выплате этой единицей или этим сектором.
in scheme: Глоссарий
preferred label: Disposable Income
top concept of: Глоссарий

Чистые страховые премии
type: Concept
comment: Из-за способа, которым определяется стоимость выпуска услуг страхования, чистые премии по страхованию, кроме страхования жизни, в целом равны скорректированным, а не фактическим страховым возмещениям. Любое расхождение между скорректированными и фактическими возмещениями представляет собой трансферт между держателями страховых полисов и страховой корпорацией. С течением времени трансферт в одном направлении погашается трансфертом в другом направлении.
comment: Because of the way in which the value of the service output is defined, net premiums for non-life insurance are equal in total to adjusted, and not actual, claims. Any variation between adjusted and actual claims represents a transfer between the policyholders and the insurance corporation. Over time, a transfer in one direction is offset by one in the other.
source: Система национальных счетов 2008
  source: https://stat.semanticpro.org/xwiki/wiki/NationalAccounts/view/%D0%91%D0%B8%D0%B1%D0%BB%D0%B8%D0%BE%D1%82%D0%B5%D0%BA%D0%B0/%D0%A1%D0%B8%D1%81%D1%82%D0%B5%D0%BC%D0%B0%20%D0%BD%D0%B0%D1%86%D0%B8%D0%BE%D…
requires: Фактическая страховая премия
requires: Услуги
term status: draft
definition: Чистые страховые премии определяются как фактические страховые премии, плюс дополнения к премиям, минус оплата услуг страхования, подлежащая уплате держателями страховых полисов/
definition: Net premiums are defined as actual premiums plus premium supplements less the insurance service charge payable by the policyholders.
in scheme: Глоссарий
preferred label: Net Premiums
related: Трансферт
related: Страхование, кроме страхования жизни
related: Страховое возмещение
related: Выпуск
related: Страховые корпорации
related: Услуги
top concept of: Глоссарий

Сальдо первичных доходов
type: Concept
comment: Сальдо первичных доходов сектора нефинансовых корпораций и сектора финансовых корпораций включает только прибыль и доходы от собственности, подлежащие получению, минус доходы от собственности, подлежащие выплате. Сальдо первичных доходов сектора государственного управления охватывает налоги на производство и импорт, подлежащие получению, за вычетом субсидий на производство, подлежащих выплате, плюс доходы от собственности, подлежащие получению, минус доходы от собственности, подлежащие выплате. Оно может также включать небольшую сумму прибыли, получаемую единицами, осуществляющими рыночное производство в рамках органов государственного управления. Сальдо первичных доходов сектора домашних хозяйств складывается из оплаты труда и смешанных доходов, получаемых домашними хозяйствами, плюс доходы от собственности, подлежащие получению, минус доходы от собственности, подлежащие выплате. В это сальдо также включается прибыль от жилищных услуг, производимых владельцами жилых помещений для собственного потребления. Сальдо первичных доходов сектора <a target="_blank" rel="noopener noreferrer" href="https://stat.semanticpro.org/xwiki/wiki/NationalAccounts/view/%D0%93%D0%BB%D0%BE%D1%81%D1%81%D0%B0%D1%80%D0%B8%D0%B8/%D0%9D%D0%B5%D0%BA%D0%BE%D0%BC%D0%BC%D0%B5%D1%80%D1%87%D0%B5%D1%81%D0%BA%D0%B8%D0%B5%20%D0%BE%D1%80%D0%B3%D0%B0%D0%BD%D0%B8%D0%B7%D0%B0%D1%86%D0%B8%D0%B8%2C%20%D0%BE%D0%B1%D1%81%D0%BB%D1%83%D0%B6%D0%B8%D0%B2%D0%B0%D1%8E%D1%89%D0%B8%D0%B5%20%D0%B4%D0%BE%D0%BC%D0%B0%D1%88%D0%BD%D0%B8%D0%B5%20%D1%85%D0%BE%D0%B7%D1%8F%D0%B9%D1%81%D1%82%D0%B2%D0%B0/">некоммерческих организаций, обслуживающих домашние хозяйства (<a target="_blank" rel="noopener noreferrer" href="https://stat.semanticpro.org/xwiki/wiki/NationalAccounts/view/%D0%93%D0%BB%D0%BE%D1%81%D1%81%D0%B0%D1%80%D0%B8%D0%B8/%D0%9D%D0%B5%D0%BA%D0%BE%D0%BC%D0%BC%D0%B5%D1%80%D1%87%D0%B5%D1%81%D0%BA%D0%B8%D0%B5%20%D0%BE%D1%80%D0%B3%D0%B0%D0%BD%D0%B8%D0%B7%D0%B0%D1%86%D0%B8%D0%B8%2C%20%D0%BE%D0%B1%D1%81%D0%BB%D1%83%D0%B6%D0%…
source: Система национальных счетов 2008
  source: https://stat.semanticpro.org/xwiki/wiki/NationalAccounts/view/%D0%91%D0%B8%D0%B1%D0%BB%D0%B8%D0%BE%D1%82%D0%B5%D0%BA%D0%B0/%D0%A1%D0%B8%D1%81%D1%82%D0%B5%D0%BC%D0%B0%20%D0%BD%D0%B0%D1%86%D0%B8%D0%BE%D…
requires: Институциональный сектор
requires: Первичные доходы
requires: Институциональная единица
term status: draft
definition: Сальдо первичных доходов представляет собой общую величину первичных доходов, подлежащих получению институциональной единицей или институциональным сектором, за вычетом общей величины первичных доходов, подлежащих выплате.
definition: The balance of primary incomes is defined as the total value of the primary incomes receivable by an institutional unit or sector less the total of the primary incomes payable.
in scheme: Глоссарий
preferred label: Balance Of Primary Incomes
related: Некоммерческие организации, обслуживающие домашние хозяйства
related: Финансовые корпорации
related: Оплата труда
related: Налоги
related: Субсидии
related: Домашнее хозяйство
related: Потребление
related: Органы государственного управления
related: Доход от собственности
related: Производство
related: Нефинансовые корпорации
related: Услуги
top concept of: Глоссарий

Доход в натуральной форме
type: Concept
comment: Наемные работники, получающие вознаграждение в натуральной форме, рассматриваются как осуществляющие расходы, равные рыночной стоимости полученных товаров или услуг (в ценах производителей, если они произведены работодателем, или в ценах покупателей, если они приобретены работодателем); при этом расходам соответствуют доходы, которые они получают в качестве вознаграждения в натуральной форме. Таким образом, стоимость товаров и услуг должна быть отражена как расходы на конечное потребление, понесенные домашними хозяйствами, а также как доход в натуральной форме.
comment: Workers receiving remuneration in kind are treated as making expenditures equal to the market value of the goods or services received (at producers’ prices if produced by the employer or at purchasers’ prices if bought by the employer), the costs of the expenditures being met out of the income they receive as remuneration in kind. Thus, the values of the goods and services must be recorded as final consumption expenditure incurred by households as well as income in kind.
source: Система национальных счетов 2008
  source: https://stat.semanticpro.org/xwiki/wiki/NationalAccounts/view/%D0%91%D0%B8%D0%B1%D0%BB%D0%B8%D0%BE%D1%82%D0%B5%D0%BA%D0%B0/%D0%A1%D0%B8%D1%81%D1%82%D0%B5%D0%BC%D0%B0%20%D0%BD%D0%B0%D1%86%D0%B8%D0%BE%D…
requires: Товары
requires: Услуги
term status: draft
definition: Income in kind received by employees is measured by the value of the goods and services provided by employers to their employees in remuneration for work done.
definition: Доход в натуральной форме, полученный наемными работниками, определяется стоимостью товаров и услуг, предоставленных работодателями их работникам в качестве вознаграждения за проделанную работу.
in scheme: Глоссарий
preferred label: Income in Kind
related: Цена покупателя
related: Цена производителя
related: Товары
related: Расходы на конечное потребление
related: Домашнее хозяйство
related: Услуги
top concept of: Глоссарий

Производные финансовые инструменты
type: Concept
comment: Стоимость производного финансового инструмента определяется ценой объекта, лежащего в основе этого инструмента: базовой ценой. Базовая цена может быть ценой товара, финансового актива, процентной ставкой, валютным курсом, ценой другого производного финансового инструмента или разницей между двумя ценами. Контракт на производный финансовый инструмент может также предусматривать его связь с индексом или корзиной цен.
comment: The value of a financial derivative derives from the price of the underlying item: the reference price. The reference price may relate to a commodity, a financial asset, an interest rate, an exchange rate, another derivative or a spread between two prices. The derivative contract may also refer to an index or a basket of prices.
source: Система национальных счетов 2008
  source: https://stat.semanticpro.org/xwiki/wiki/NationalAccounts/view/%D0%91%D0%B8%D0%B1%D0%BB%D0%B8%D0%BE%D1%82%D0%B5%D0%BA%D0%B0/%D0%A1%D0%B8%D1%81%D1%82%D0%B5%D0%BC%D0%B0%20%D0%BD%D0%B0%D1%86%D0%B8%D0%BE%D…
requires: Товары
term status: draft
definition: Financial derivatives are financial instruments that are linked to a specific financial instrument or indicator or commodity, through which specific financial risks can be traded in financial markets in their own right.
definition: Производные финансовые инструменты являются финансовыми инструментами, которые связаны с конкретным финансовым инструментом, или показателем, или товаром, благодаря чему конкретные финансовые риски могут быть предметом обмена на финансовых рынках в их собственном качестве.
in scheme: Глоссарий
preferred label: Financial Derivatives
related: Цена
related: Товары
related: Финансовые активы
top concept of: Глоссарий

Опционы
type: Concept
comment: Многие опционные контракты, если они осуществляются, реализуются путем наличных платежей, а не путем поставки активов или товаров, к которым относился контракт.
comment: Many options contracts, if exercised, are settled by a cash payment rather than by delivery of the underlying assets or commodities to which the contract relates.
source: Система национальных счетов 2008
  source: https://stat.semanticpro.org/xwiki/wiki/NationalAccounts/view/%D0%91%D0%B8%D0%B1%D0%BB%D0%B8%D0%BE%D1%82%D0%B5%D0%BA%D0%B0/%D0%A1%D0%B8%D1%81%D1%82%D0%B5%D0%BC%D0%B0%20%D0%BD%D0%B0%D1%86%D0%B8%D0%BE%D…
term status: draft
definition: Опционы являются контрактами, которые дают их покупателю право, но не связывают его обязательством купить (опцион «колл») или продать (опцион «пут») определенный финансовый инструмент или товар по определенной цене (цене исполнения) в течение определенного периода времени (американский опцион) или на определенную дату (европейский опцион).
definition: Options are contracts that give the purchaser of the option the right, but not the obligation, to buy (a “call” option) or to sell (a “put” option) a particular financial instrument or commodity at a predetermined price (the “strike” price) within a given time span (American option) or on a given date (European option).
in scheme: Глоссарий
preferred label: Options
related: Товары
related: Актив
top concept of: Глоссарий

Дополнения к отчислениям домашних хозяйств на социальное страхование
type: Concept
comment: Эта сумма включается в доход от собственности, подлежащий выплате управляющими пенсионных фондов домашним хозяйствам и отражаемый в счете распределения первичных доходов.
source: Система национальных счетов 2008
  source: https://stat.semanticpro.org/xwiki/wiki/NationalAccounts/view/%D0%91%D0%B8%D0%B1%D0%BB%D0%B8%D0%BE%D1%82%D0%B5%D0%BA%D0%B0/%D0%A1%D0%B8%D1%81%D1%82%D0%B5%D0%BC%D0%B0%20%D0%BD%D0%B0%D1%86%D0%B8%D0%BE%D…
requires: Актив
requires: Доход от собственности
term status: draft
definition: Дополнения к отчислениям домашних хозяйств на социальное страхование включают доход от собственности, заработанный в течение отчетного периода от инвестирования средств активов в форме прав на пенсионные и непенсионные пособия.
definition: Households’ social contribution supplements consist of the property income earned during the accounting period on the stock of pension and non-pension entitlements.
in scheme: Глоссарий
preferred label: Households’ Social Contribution Supplements
related: Первичные доходы
related: Домашнее хозяйство
related: Доход от собственности
top concept of: Глоссарий

Транспортное оборудование
type: Concept
comment: Examples include products other than parts included in CPC 2.0 division 49, transport equipment, such as motor vehicles, trailers and semi-trailers; ships; railway and tramway locomotives and rolling stock; aircraft and spacecraft; and motorcycles, bicycles, etc.
comment: Примерами являются продукты, кроме запасных частей, включенные в CPC-2.0 в раздел 49: транспортное оборудование, такое как автомашины, трейлеры и полутрейлеры; суда; железнодорожные и трамвайные локомотивы и подвижной состав; самолеты и космические корабли; мотоциклы, велосипеды и т.д.
source: Система национальных счетов 2008
  source: https://stat.semanticpro.org/xwiki/wiki/NationalAccounts/view/%D0%91%D0%B8%D0%B1%D0%BB%D0%B8%D0%BE%D1%82%D0%B5%D0%BA%D0%B0/%D0%A1%D0%B8%D1%81%D1%82%D0%B5%D0%BC%D0%B0%20%D0%BD%D0%B0%D1%86%D0%B8%D0%BE%D…
term status: draft
broader: Машины и оборудование
definition: Transport equipment consists of equipment for moving people and objects.
definition: Транспортное оборудование включает оборудование для перемещения людей и грузов.
in scheme: Глоссарий
preferred label: Transport Equipment
related: Продукты
top concept of: Глоссарий

Товары
type: Concept
comment: Индивидуальные товары и услуги, как правило, приобретаются и продаются на рынке, хотя они могут также предоставляться бесплатно или в ценах, которые не являются экономически значимыми, например, товары и услуги, предоставляемые в качестве <a target="_blank" rel="noopener noreferrer" href="https://stat.semanticpro.org/xwiki/wiki/NationalAccounts/view/%D0%93%D0%BB%D0%BE%D1%81%D1%81%D0%B0%D1%80%D0%B8%D0%B8/%D0%A1%D0%BE%D1%86%D0%B8%D0%B0%D0%BB%D1%8C%D0%BD%D1%8B%D0%B5%20%D1%82%D1%80%D0%B0%D0%BD%D1%81%D1%84%D0%B5%D1%80%D1%82%D1%8B%20%D0%B2%20%D0%BD%D0%B0%D1%82%D1%83%D1%80%D0%B0%D0%BB%D1%8C%D0%BD%D0%BE%D0%B9%20%D1%84%D0%BE%D1%80%D0%BC%D0%B5/">социальных трансфертов в натуральной форме. На практике все товары и большинство услуг являются индивидуальными.
source: Система национальных счетов 2008
  source: https://stat.semanticpro.org/xwiki/wiki/NationalAccounts/view/%D0%91%D0%B8%D0%B1%D0%BB%D0%B8%D0%BE%D1%82%D0%B5%D0%BA%D0%B0/%D0%A1%D0%B8%D1%81%D1%82%D0%B5%D0%BC%D0%B0%20%D0%BD%D0%B0%D1%86%D0%B8%D0%BE%D…
requires: Институциональная единица
requires: Операция
term status: draft
broader: Продукты
definition: Goods are physical, produced objects for which a demand exists, over which ownership rights can be established and whose ownership can be transferred from one institutional unit to another by engaging in transactions on markets.
definition: Товары представляют собой материально-вещественные произведенные объекты, на которые существует спрос, и в отношении которых могут быть установлены права собственности, которые могут быть переданы от одной институциональной единицы другой путем участия в операциях на рынках.
in scheme: Глоссарий
preferred label: Goods
related: Цена
related: Социальные трансферты в натуральной форме
related: Услуги
top concept of: Глоссарий

Корпорации, принимающие депозиты, кроме центрального банка
type: Concept
comment: С этой целью корпорации принимают обязательства в форме депозитов или финансовых инструментов (таких как краткосрочные депозитные сертификаты), которые являются близкими аналогами депозитов.
source: Система национальных счетов 2008
  source: https://stat.semanticpro.org/xwiki/wiki/NationalAccounts/view/%D0%91%D0%B8%D0%B1%D0%BB%D0%B8%D0%BE%D1%82%D0%B5%D0%BA%D0%B0/%D0%A1%D0%B8%D1%81%D1%82%D0%B5%D0%BC%D0%B0%20%D0%BD%D0%B0%D1%86%D0%B8%D0%BE%D…
requires: Основная деятельность
term status: draft
definition: Deposit-taking corporations except the central bank have financial intermediation as their principal activity. To this end, they have liabilities in the form of deposits or financial instruments (such as short-term certificates of deposit) that are close substitutes for deposits.
definition: Корпорации, принимающие депозиты, кроме центрального банка, осуществляют финансовое посредничество в качестве их основного вида деятельности.
in scheme: Глоссарий
preferred label: Deposit-Taking Corporations
related: Корпорация
related: Обязательство
top concept of: Глоссарий

Потребление
type: Concept
comment: Удовлетворение потребностей или желаний человека является немедленным и прямым в случае конечного потребления; оно является косвенным и отложенным в случае промежуточного потребления, в процессе которого товары и услуги используются, чтобы произвести другие товары и услуги, которые в конечном счете обеспечивают удовлетворение потребностей или желаний человека.
comment: The activity of consumption consists of the use of goods and services for the satisfaction of individual or collective human needs or wants
source: Система национальных счетов 2008
  source: https://stat.semanticpro.org/xwiki/wiki/NationalAccounts/view/%D0%91%D0%B8%D0%B1%D0%BB%D0%B8%D0%BE%D1%82%D0%B5%D0%BA%D0%B0/%D0%A1%D0%B8%D1%81%D1%82%D0%B5%D0%BC%D0%B0%20%D0%BD%D0%B0%D1%86%D0%B8%D0%BE%D…
requires: Товары
requires: Услуги
term status: draft
definition: Деятельность, связанная с потреблением, состоит из использования товаров и услуг для удовлетворения индивидуальных или коллективных потребностей или желаний человека.
in scheme: Глоссарий
preferred label: Consumption
related: Товары
related: Промежуточное потребление
related: Услуги
top concept of: Глоссарий

Вычитаемый НДС
type: Concept
source: Система национальных счетов 2008
  source: https://stat.semanticpro.org/xwiki/wiki/NationalAccounts/view/%D0%91%D0%B8%D0%B1%D0%BB%D0%B8%D0%BE%D1%82%D0%B5%D0%BA%D0%B0/%D0%A1%D0%B8%D1%81%D1%82%D0%B5%D0%BC%D0%B0%20%D0%BD%D0%B0%D1%86%D0%B8%D0%BE%D…
requires: Налог на добавленную стоимость
requires: Валовое накопление основного капитала
requires: Товары
requires: Промежуточное потребление
requires: Обязательство
requires: Органы государственного управления
requires: Услуги
term status: draft
broader: Налог на добавленную стоимость
definition: Deductible VAT is the VAT payable on purchases of goods or services intended for intermediate consumption, gross fixed capital formation or for resale that a producer is permitted to deduct from his own VAT liability to the government in respect of VAT invoiced to his customers
definition: Вычитаемый НДС — это НДС, подлежащий уплате с покупок товаров или услуг, предназначенных для промежуточного потребления, валового накопления основного капитала или для перепродажи, который производителю разрешено вычесть из его собственного обязательства перед органами государственного управления в отношении НДС, начисленного покупателю.
in scheme: Глоссарий
preferred label: Deductible VAT
top concept of: Глоссарий

Скорректированный располагаемый доход
type: Concept
source: Система национальных счетов 2008
  source: https://stat.semanticpro.org/xwiki/wiki/NationalAccounts/view/%D0%91%D0%B8%D0%B1%D0%BB%D0%B8%D0%BE%D1%82%D0%B5%D0%BA%D0%B0/%D0%A1%D0%B8%D1%81%D1%82%D0%B5%D0%BC%D0%B0%20%D0%BD%D0%B0%D1%86%D0%B8%D0%BE%D…
requires: Институциональный сектор
requires: Располагаемый доход
requires: Институциональная единица
requires: Социальные трансферты в натуральной форме
requires: Доход в натуральной форме
requires: Балансирующая статья
term status: draft
definition: Скорректированный располагаемый доход представляет собой балансирующую статью счета перераспределения доходов в натуральной форме. Он исчисляется путем внесения ряда коррективов (добавлений и вычитаний) к располагаемому доходу институциональной единицы или институционального сектора, а именно, путем добавления стоимости <a target="_blank" rel="noopener noreferrer" href="https://stat.semanticpro.org/xwiki/wiki/NationalAccounts/view/%D0%93%D0%BB%D0%BE%D1%81%D1%81%D0%B0%D1%80%D0%B8%D0%B8/%D0%A1%D0%BE%D1%86%D0%B8%D0%B0%D0%BB%D1%8C%D0%BD%D1%8B%D0%B5%20%D1%82%D1%80%D0%B0%D0%BD%D1%81%D1%84%D0%B5%D1%80%D1%82%D1%8B%20%D0%B2%20%D0%BD%D0%B0%D1%82%D1%83%D1%80%D0%B0%D0%BB%D1%8C%D0%BD%D0%BE%D0%B9%20%D1%84%D0%BE%D1%80%D0%BC%D0%B5/">социальных трансфертов в натуральной форме, подлежащих получению этой единицей или этим сектором, и вычитания стоимости <a target="_blank" rel="noopener noreferrer" href="https://stat.semanticpro.org/xwiki/wiki/NationalAccounts/view/%D0%93%D0%BB%D0%BE%D1%81%D1%81%D0%B0%D1%80%D0%B8%D0%B8/%D0%A1%D0%BE%D1%86%D0%B8%D0%B0%D0%BB%D1%8C%D0%BD%D1%8B%D0%B5%20%D1%82%D1%80%D0%B0%D0%BD%D1%81%D1%84%D0%B5%D1%80%D1%82%D1%8B%20%D0%B2%20%D0%BD%D0%B0%D1%82%D1%83%D1%80%D0%B0%D0%BB%D1%8C%D0%BD%D0%BE%D0%B9%20%D1%84%D0%BE%D1%80%D0%BC%D0%B5/">социальных трансфертов в натуральной форме, подлежащих выплате этой единицей или этим сектором.
in scheme: Глоссарий
preferred label: Adjusted Disposable Income
top concept of: Глоссарий

Самостоятельно занятые лица
type: Concept
comment: Лица, которые работают в некорпорированных предприятиях, классифицируются как самостоятельно занятые лица, если они не являются наемными работниками, получающими оплату, составляющую их основной источник дохода; в этом случае они классифицируются как лица, работающие по найму. Они могут временно не работать в течение периода обследования по какой-либо конкретной причине. Оплата труда при самостоятельной занятости включается в смешанный доход, потому что невозможно отделить доход по труду и доход на капитал, используемый в некорпорированном предприятии. Самостоятельно занятые лица включают следующие категории: помогающие члены семьи, работающие в некорпорированных предприятиях надомники, чей доход зависит от стоимости продукции какого-либо процесса производства, за который они несут ответственность; при этом не имеет значения, много или мало работы они выполнили лица, занятые в производстве, предпринимаемом полностью для их собственного конечного потребления или накопления на индивидуальной или коллективной основе. (Примером последнего является строительство для нужд общины.)
source: Система национальных счетов 2008
  source: https://stat.semanticpro.org/xwiki/wiki/NationalAccounts/view/%D0%91%D0%B8%D0%B1%D0%BB%D0%B8%D0%BE%D1%82%D0%B5%D0%BA%D0%B0/%D0%A1%D0%B8%D1%81%D1%82%D0%B5%D0%BC%D0%B0%20%D0%BD%D0%B0%D1%86%D0%B8%D0%BE%D…
requires: Квазикорпорация
requires: Некорпорированное предприятие
term status: draft
alternative label: Самозанятые
definition: Самостоятельно занятые лица — это лица, являющиеся единоличными собственниками или совладельцами некорпорированных предприятий, в которых они работают, исключая те некорпорированные предприятия, которые классифицируются как квазикорпорации.
definition: Self-employed persons are persons who are the sole or joint owners of the unincorporated enterprises in which they work, excluding those unincorporated enterprises that are classified as quasi-corporations.
in scheme: Глоссарий
preferred label: Self-Employed Persons
related: Предприятие
related: Продукты
related: Потребление
related: Производство
top concept of: Глоссарий

Кредитные производные финансовые инструменты
type: Concept
comment: Они предназначены для торговли рисками вследствие неплатежей по ссудам и ценным бумагам. Кредитные производные финансовые инструменты принимают форму контрактов типа форвардов и опционов и, как другие производные финансовые инструменты, они часто составляются согласно основным стандартным юридическим соглашениям и пред усматривают процедуры выплаты залогов и гарантийных взносов, что дает возможность определить их рыночную стоимость.
source: Система национальных счетов 2008
  source: https://stat.semanticpro.org/xwiki/wiki/NationalAccounts/view/%D0%91%D0%B8%D0%B1%D0%BB%D0%B8%D0%BE%D1%82%D0%B5%D0%BA%D0%B0/%D0%A1%D0%B8%D1%81%D1%82%D0%B5%D0%BC%D0%B0%20%D0%BD%D0%B0%D1%86%D0%B8%D0%BE%D…
requires: Производные финансовые инструменты
term status: draft
definition: Credit derivatives are financial derivatives whose primary purpose is to trade credit risk.
definition: Кредитные производные финансовые инструменты — это производные финансовые инструменты, основной целью которых является торговля кредитным риском.
in scheme: Глоссарий
preferred label: Credit Derivatives
related: Ценные бумаги
related: Производные финансовые инструменты
related: Опционы
related: Ссуды
top concept of: Глоссарий

Другие субсидии на продукты
type: Concept
comment: The most common types are the following: a. Subsidies on products used domestically; b. Losses of government trading organizations; c. Subsidies to public corporations and quasicorporations$. d. Subsidies resulting from the central bank accepting a lower rate of interest than the market rate.
comment: К наиболее распространенным субсидиям этого вида относятся следующие: субсидии на продукты, используемые внутри страны возмещение убытков государственных внешне торговых организаций субсидии государственным корпорациям и квазикорпорациям субсидии в результате установления центральным банком процентной ставки более высокой, чем рыночная.
source: Система национальных счетов 2008
  source: https://stat.semanticpro.org/xwiki/wiki/NationalAccounts/view/%D0%91%D0%B8%D0%B1%D0%BB%D0%B8%D0%BE%D1%82%D0%B5%D0%BA%D0%B0/%D0%A1%D0%B8%D1%81%D1%82%D0%B5%D0%BC%D0%B0%20%D0%BD%D0%B0%D1%86%D0%B8%D0%BE%D…
requires: Предприятие
requires: Товары
requires: Трансферт
requires: Субсидии
requires: Потребление
requires: Услуги
requires: Производство
term status: draft
broader: Субсидии
definition: Другие субсидии на продукты включают субсидии на товары и услуги, произведенные или импортированные предприятиями-резидентами, которые становятся подлежащими уплате в результате производства, продажи, трансферта, аренды или поставки этих товаров и услуг или в результате их использования для собственного потребления или накопления.
definition: Other subsidies on products consist of subsidies on goods or services produced as the outputs of resident enterprises, or on imports, that become payable as a result of the production, sale, transfer, leasing or delivery of those goods or services, or as a result of their use for own consumption or own capital formation.
in scheme: Глоссарий
preferred label: Other Subsidies on Products
related: Квазикорпорация
related: Корпорация
related: Центральный банк
top concept of: Глоссарий

Расходы на конечное потребление сектора государственного управления
type: Concept
comment: Расходы на конечное потребление сектора государственного управления могут быть классифицированы несколькими способами. В частности, они могут быть классифицированы: В соответствии с тем, были ли товары или услуги произведены рыночными или нерыночными производителями; В соответствии с тем, были ли расходы произведены на коллективные услуги или на индивидуальные товары или услуги; В соответствии с функцией или целью согласно Классификации функций органов государственного управления (КФОГУ); или В соответствии с типом товара или услуги согласно КОП.
source: Система национальных счетов 2008
  source: https://stat.semanticpro.org/xwiki/wiki/NationalAccounts/view/%D0%91%D0%B8%D0%B1%D0%BB%D0%B8%D0%BE%D1%82%D0%B5%D0%BA%D0%B0/%D0%A1%D0%B8%D1%81%D1%82%D0%B5%D0%BC%D0%B0%20%D0%BD%D0%B0%D1%86%D0%B8%D0%BE%D…
requires: Товары
requires: Потребление
requires: Услуга коллективного потребления
requires: Услуги
term status: draft
broader: Расходы на конечное потребление
definition: Расходы на конечное потребление сектора государственного управления состоят из расходов (включая расходы, стоимость которых должна быть оценена косвенным образом), понесенных сектором государственного управления как на товары и услуги индивидуального потребления, так и на услуги коллективного потребления.
definition: General government final consumption expenditure consists of expenditure, including expenditure whose value must be estimated indirectly, incurred by general government on both individual consumption goods and services and collective consumption services.
in scheme: Глоссарий
preferred label: General Government Final Consumption Expenditure
related: Товары
related: Органы государственного управления
related: Услуги
top concept of: Глоссарий

Резервные активы
type: Concept
comment: Резервные активы номинируются в иностранной валюте, и в ней же производятся расчеты по ним.
source: Система национальных счетов 2008
  source: https://stat.semanticpro.org/xwiki/wiki/NationalAccounts/view/%D0%91%D0%B8%D0%B1%D0%BB%D0%B8%D0%BE%D1%82%D0%B5%D0%BA%D0%B0/%D0%A1%D0%B8%D1%81%D1%82%D0%B5%D0%BC%D0%B0%20%D0%BD%D0%B0%D1%86%D0%B8%D0%BE%D…
requires: Актив
term status: draft
broader: Актив
definition: Резервные активы — это внешние активы, которыми располагают органы денежно-кредитного регулирования и которые контролируются ими и в любой момент могут быть использованы для финансирования дефицита платежного баланса, для интервенций на валютных рынках с целью воздействия на валютный курс и для иных связанных с этим целей (таких как поддержание доверия к валюте и экономике страны, создание основы для заимствования за рубежом).
definition: Reserve assets are those external assets that are readily available to and controlled by monetary authorities for meeting balance of payments financing needs, for intervention in exchange markets to affect the currency exchange rate and for other related purposes (such as maintaining confidence in the currency and the economy, and serving as a basis for foreign borrowing). Reserve assets must be denominated and settled in foreign currency.
in scheme: Глоссарий
preferred label: Reserve Assets
top concept of: Глоссарий

Рыночные производители
type: Concept
source: Система национальных счетов 2008
  source: https://stat.semanticpro.org/xwiki/wiki/NationalAccounts/view/%D0%91%D0%B8%D0%B1%D0%BB%D0%B8%D0%BE%D1%82%D0%B5%D0%BA%D0%B0/%D0%A1%D0%B8%D1%81%D1%82%D0%B5%D0%BC%D0%B0%20%D0%BD%D0%B0%D1%86%D0%B8%D0%BE%D…
source: Система национальных счетов 2008
  source: https://stat.semanticpro.org/xwiki/wiki/NationalAccounts/view/%D0%91%D0%B8%D0%B1%D0%BB%D0%B8%D0%BE%D1%82%D0%B5%D0%BA%D0%B0/%D0%A1%D0%B8%D1%81%D1%82%D0%B5%D0%BC%D0%B0%20%D0%BD%D0%B0%D1%86%D0%B8%D0%BE%D…
requires: Заведение
requires: Некоммерческие организации, обслуживающие домашние хозяйства
requires: Цена
requires: Товары
requires: Рыночный выпуск
requires: Домашнее хозяйство
requires: Выпуск
requires: Органы государственного управления
requires: Услуги
term status: draft
definition: Рыночные производители представляют собой заведения, весь выпуск которых или большая часть его является рыночным.
definition: Нерыночные производители включают заведения, принадлежащие органам государственного управления или <a target="_blank" rel="noopener noreferrer" href="https://stat.semanticpro.org/xwiki/wiki/NationalAccounts/view/%D0%93%D0%BB%D0%BE%D1%81%D1%81%D0%B0%D1%80%D0%B8%D0%B8/%D0%9D%D0%B5%D0%BA%D0%BE%D0%BC%D0%BC%D0%B5%D1%80%D1%87%D0%B5%D1%81%D0%BA%D0%B8%D0%B5%20%D0%BE%D1%80%D0%B3%D0%B0%D0%BD%D0%B8%D0%B7%D0%B0%D1%86%D0%B8%D0%B8%2C%20%D0%BE%D0%B1%D1%81%D0%BB%D1%83%D0%B6%D0%B8%D0%B2%D0%B0%D1%8E%D1%89%D0%B8%D0%B5%20%D0%B4%D0%BE%D0%BC%D0%B0%D1%88%D0%BD%D0%B8%D0%B5%20%D1%85%D0%BE%D0%B7%D1%8F%D0%B9%D1%81%D1%82%D0%B2%D0%B0/">НКОДХ, которые предоставляют товары и услуги бесплатно или по экономически незначимым ценам домашним хозяйствам или обществу в целом.
definition: Non-market producers consist of establishments owned by government units or NPISHs that supply goods or services free, or at prices that are not economically significant, to households or the community as a whole.
in scheme: Глоссарий
preferred label: Non-Market Producers
preferred label: Нерыночные производители
top concept of: Глоссарий

Текущие налоги на капитал
type: Concept
comment: Текущие налоги на доходы, имущество и т.д., подлежащие получению, показаны на стороне ресурсов для сектора государственного управления и, возможно, для остального мира, а налоги, подлежащие уплате, показаны на стороне использования для секторов домашних хозяйств, нефинансовых и финансовых корпораций и, возможно, для сектора <a target="_blank" rel="noopener noreferrer" href="https://stat.semanticpro.org/xwiki/wiki/NationalAccounts/view/%D0%93%D0%BB%D0%BE%D1%81%D1%81%D0%B0%D1%80%D0%B8%D0%B8/%D0%9D%D0%B5%D0%BA%D0%BE%D0%BC%D0%BC%D0%B5%D1%80%D1%87%D0%B5%D1%81%D0%BA%D0%B8%D0%B5%20%D0%BE%D1%80%D0%B3%D0%B0%D0%BD%D0%B8%D0%B7%D0%B0%D1%86%D0%B8%D0%B8%2C%20%D0%BE%D0%B1%D1%81%D0%BB%D1%83%D0%B6%D0%B8%D0%B2%D0%B0%D1%8E%D1%89%D0%B8%D0%B5%20%D0%B4%D0%BE%D0%BC%D0%B0%D1%88%D0%BD%D0%B8%D0%B5%20%D1%85%D0%BE%D0%B7%D1%8F%D0%B9%D1%81%D1%82%D0%B2%D0%B0/">некоммерческих организаций, обслуживающих домашние хозяйства, и для остального мира.
source: Система национальных счетов 2008
  source: https://stat.semanticpro.org/xwiki/wiki/NationalAccounts/view/%D0%91%D0%B8%D0%B1%D0%BB%D0%B8%D0%BE%D1%82%D0%B5%D0%BA%D0%B0/%D0%A1%D0%B8%D1%81%D1%82%D0%B5%D0%BC%D0%B0%20%D0%BD%D0%B0%D1%86%D0%B8%D0%BE%D…
requires: Предприятие
requires: Налоги
requires: Чистая стоимость капитала
requires: Институциональная единица
requires: Земля
requires: Актив
requires: Производство
term status: draft
definition: Текущие налоги на капитал охватывают налоги, подлежащие периодической выплате, обычно ежегодно, на собственность или чистую стоимость капитала институциональной единицы, за исключением налогов на землю или другие активы, принадлежащие предприятиям или арендуемые ими и используемые для целей производства; такие налоги рассматриваются как другие налоги на производство.
definition: Current taxes on capital consist of taxes that are payable periodically, usually annually, on the property or net wealth of institutional units, excluding taxes on land or other assets owned or rented by enterprises and used by them for production, such taxes being treated as other taxes on production.
in scheme: Глоссарий
preferred label: Current Taxes on Capital
related: Некоммерческие организации, обслуживающие домашние хозяйства
related: Финансовые корпорации
related: Налоги
related: Остальной мир
related: Налоги на доходы
related: Домашнее хозяйство
top concept of: Глоссарий

Заработанная страховая премия
type: Concept
comment: Например, если годовой полис с премией в размере 120 единиц вступает в силу 1 апреля, а счета составляются за календарный год, то заработанная премия в календарном году будет равна 90. Устанавливая размер страховых премий, что страховая корпорация должна делать заранее, она производит оценку размера ожидаемых возмещений, которые ей предстоит выплачивать. В СНС рассматриваются два метода определения соответствующего размера возмещений (называемых скорректированными возмещениями). Один метод — exante метод, называемый также методом на основе ожидаемых оценок, в соответствии с которым оценки скорректированных возмещений получаются на основе использования модели, отражающей прошлый тренд в отношении возмещений, подлежащих выплате страховыми корпорациями. Другой метод исчисления скорректированных возмещений основан на использовании информации, содержащейся в счетах страховых корпораций.
source: Система национальных счетов 2008
  source: https://stat.semanticpro.org/xwiki/wiki/NationalAccounts/view/%D0%91%D0%B8%D0%B1%D0%BB%D0%B8%D0%BE%D1%82%D0%B5%D0%BA%D0%B0/%D0%A1%D0%B8%D1%81%D1%82%D0%B5%D0%BC%D0%B0%20%D0%BD%D0%B0%D1%86%D0%B8%D0%BE%D…
requires: Фактическая страховая премия
term status: draft
broader: Фактическая страховая премия
definition: The premium earned is the part of the actual premium that relates to cover provided in the accounting period.
definition: Заработанная страховая премия — это часть фактической страховой премии, которая относится к страховому покрытию, предоставленному в отчетном периоде.
in scheme: Глоссарий
preferred label: Premium Earned
related: Корпорация
related: Страховое возмещение
top concept of: Глоссарий

Фактические отчисления домашних хозяйств на социальное страхование
type: Concept
source: Система национальных счетов 2008
  source: https://stat.semanticpro.org/xwiki/wiki/NationalAccounts/view/%D0%91%D0%B8%D0%B1%D0%BB%D0%B8%D0%BE%D1%82%D0%B5%D0%BA%D0%B0/%D0%A1%D0%B8%D1%81%D1%82%D0%B5%D0%BC%D0%B0%20%D0%BD%D0%B0%D1%86%D0%B8%D0%BE%D…
requires: Отчисления на социальное страхование
requires: Программа социального страхования
requires: Самостоятельно занятые лица
term status: draft
definition: Фактические отчисления домашних хозяйств на социальное страхование — это отчисления на социальное страхование, подлежащие выплате от своего лица наемными работниками, самостоятельно занятыми или незанятыми лицами в программы социального страхования.
definition: Households’ actual social contributions are social contributions payable on their own behalf by employees, self-employed or non-employed persons to social insurance schemes.
in scheme: Глоссарий
preferred label: Households Actual Social Contributions
top concept of: Глоссарий

Квазикорпорация
type: Concept
comment: В СНС рассматриваются три основных типа квазикорпораций: некорпорированные предприятия, принадлежащие органам государственного управления, которые заняты рыночным производством и которые функционируют так же, как государственные корпорации некорпорированные предприятия, включая некорпорированные партнерства или трасты, принадлежащие домашним хозяйствам, которые функционируют так, как если бы они были корпорациями в частной собственности некорпорированные предприятия, принадлежащие институциональным единицам, являющимся резидентами остального мира, которые известны как филиалы.
comment: Three main kinds of quasi-corporations are recognized in the SNA: a. Unincorporated enterprises owned by government units that are engaged in market production and that are operated in a similar way to publicly owned corporations; b. Unincorporated enterprises, including unincorporated partnerships or trusts, owned by households that are operated as if they were privately owned corporations; c. Unincorporated enterprises that belong to institut
source: Система национальных счетов 2008
  source: https://stat.semanticpro.org/xwiki/wiki/NationalAccounts/view/%D0%91%D0%B8%D0%B1%D0%BB%D0%B8%D0%BE%D1%82%D0%B5%D0%BA%D0%B0/%D0%A1%D0%B8%D1%81%D1%82%D0%B5%D0%BC%D0%B0%20%D0%BD%D0%B0%D1%86%D0%B8%D0%BE%D…
requires: Институциональная единица
requires: Корпорация
requires: Некорпорированное предприятие
requires: Производство
term status: draft
broader: Корпорация
definition: Квазикорпорация — это либо некорпорированное предприятие, находящееся в собственности резидентской институциональной единицы, которое располагает достаточной информацией для составления полной последовательности счетов, функционирует так же, как если бы оно было отдельной корпорацией и отношения которого де факто с его собственником являются такими же, как отношения корпорации с акционерами, либо некорпорированное предприятие, принадлежащее нерезидентской институциональной единице, которое рассматривается как резидентская институциональная единица, так как оно занято в значительных размерах производством на экономической территории данной страны в течение длительного или неопределенного периода времени.
definition: A quasi-corporation is either an unincorporated enterprise owned by a resident institutional unit that has sufficient information to compile a complete set of accounts and is operated as if it were a separate corporation and whose de facto relationship to its owner is that of a corporation to its shareholders, or an unincorporated enterprise owned by a non-resident institutional unit that is deemed to be a resident institutional unit because it engages in a significant amount of production in the economic territory over a long or indefinite period of time.
in scheme: Глоссарий
preferred label: Quasi-Corporation
related: Институциональная единица
related: Корпорация
related: Остальной мир
related: Домашнее хозяйство
related: Некорпорированное предприятие
related: Органы государственного управления
related: Производство
top concept of: Глоссарий

Пособия по социальной помощи в денежной форме
type: Concept
source: Система национальных счетов 2008
  source: https://stat.semanticpro.org/xwiki/wiki/NationalAccounts/view/%D0%91%D0%B8%D0%B1%D0%BB%D0%B8%D0%BE%D1%82%D0%B5%D0%BA%D0%B0/%D0%A1%D0%B8%D1%81%D1%82%D0%B5%D0%BC%D0%B0%20%D0%BD%D0%B0%D1%86%D0%B8%D0%BE%D…
requires: Отчисления на социальное страхование
requires: Некоммерческие организации, обслуживающие домашние хозяйства
requires: Текущий трансферт
requires: Программа социального страхования
requires: Домашнее хозяйство
term status: draft
definition: Social assistance benefits in cash are current transfers payable to households by government units or NPISHs to meet the same needs as social insurance benefits but which are not made under a social insurance scheme requiring participation usually by means of social contributions.
definition: Пособия по социальной помощи в денежной форме — это текущие трансферты, подлежащие выплате домашним хозяйствам единицами сектора государственного управления или <a target="_blank" rel="noopener noreferrer" href="https://stat.semanticpro.org/xwiki/wiki/NationalAccounts/view/%D0%93%D0%BB%D0%BE%D1%81%D1%81%D0%B0%D1%80%D0%B8%D0%B8/%D0%9D%D0%B5%D0%BA%D0%BE%D0%BC%D0%BC%D0%B5%D1%80%D1%87%D0%B5%D1%81%D0%BA%D0%B8%D0%B5%20%D0%BE%D1%80%D0%B3%D0%B0%D0%BD%D0%B8%D0%B7%D0%B0%D1%86%D0%B8%D0%B8%2C%20%D0%BE%D0%B1%D1%81%D0%BB%D1%83%D0%B6%D0%B8%D0%B2%D0%B0%D1%8E%D1%89%D0%B8%D0%B5%20%D0%B4%D0%BE%D0%BC%D0%B0%D1%88%D0%BD%D0%B8%D0%B5%20%D1%85%D0%BE%D0%B7%D1%8F%D0%B9%D1%81%D1%82%D0%B2%D0%B0/">НКОДХ для обеспечения тех же потребностей, которые обеспечиваются пособиями по социальному страхованию, но которые не выплачиваются в рамках программы социального страхования, участие в которой обычно требует выплаты отчислений на социальное страхование.
in scheme: Глоссарий
preferred label: Social Assistance Benefits In Cash
top concept of: Глоссарий

Изменение запасов материальных оборотных средств
type: Concept
comment: Некоторые из этих поступлений и выбытий относятся к фактическим покупкам или продажам, но другие отражают операции, которые происходят внутри предприятия.
comment: Some of these acquisitions and disposals are attributable to actual purchases or sales, but others reflect transactions that are internal to the enterprise.
source: Система национальных счетов 2008
  source: https://stat.semanticpro.org/xwiki/wiki/NationalAccounts/view/%D0%91%D0%B8%D0%B1%D0%BB%D0%B8%D0%BE%D1%82%D0%B5%D0%BA%D0%B0/%D0%A1%D0%B8%D1%81%D1%82%D0%B5%D0%BC%D0%B0%20%D0%BD%D0%B0%D1%86%D0%B8%D0%BE%D…
requires: Материальные оборотные средства
requires: Запасы
requires: Товары
term status: draft
definition: Изменение запасов материальных оборотных средств определяется как стоимость поступлений в запасы материальных оборотных средств за вычетом стоимости выбытий из запасов и за вычетом стоимости любых текущих потерь товаров, которые находились в запасах материальных оборотных средств, в течение отчетного периода.
definition: Changes in inventories are measured by the value of the entries into inventories less the value of withdrawals and less the value of any recurrent losses of goods held in inventories during the accounting period.
in scheme: Глоссарий
preferred label: Changes in Inventories
related: Предприятие
related: Операция
top concept of: Глоссарий

Таблица использования в ценах
type: Concept
comment: With a complete set of product balances, supply and use tables can be created. Supply and use tables exist in pairs with common valuation and level of detail as regards the products identified. The most common format of supply and use tables is at purchasers’ prices.
comment: Имея полный набор балансов продуктов, можно создать таблицы ресурсов и использования. Таблицы ресурсов и использования состоят из двух частей с общей стоимостной оценкой и степенью детализации в отношении идентифицированных продуктов. Наиболее стандартным является формат таблиц ресурсов и использования в ценах покупателей.
source: Система национальных счетов 2008
  source: https://stat.semanticpro.org/xwiki/wiki/NationalAccounts/view/%D0%91%D0%B8%D0%B1%D0%BB%D0%B8%D0%BE%D1%82%D0%B5%D0%BA%D0%B0/%D0%A1%D0%B8%D1%81%D1%82%D0%B5%D0%BC%D0%B0%20%D0%BD%D0%B0%D1%86%D0%B8%D0%BE%D…
requires: Баланс продукта
requires: Цена покупателя
requires: Продукты
term status: draft
definition: Таблица использования в ценах покупателей состоит из набора балансов продуктов, охватывающих все продукты, имеющиеся в экономике, организованного в форме прямоугольной матрицы с группами продуктов, оцененных в ценах покупателей, которые отражаются в строках и колонках, показывающих отнесение продуктов к различным типам использования.
definition: A use table at purchasers’ prices consists of a set of product balances covering all products available in an economy arranged in the form of a rectangular matrix with the products, valued at purchasers’ prices, appearing in the rows and the columns indicating the disposition of the products to various types of uses.
in scheme: Глоссарий
preferred label: Table at Purchasers’ Prices
related: Баланс продукта
related: Цена покупателя
related: Продукты
top concept of: Глоссарий

Цена покупателя
type: Concept
comment: Если покупатель приобретает товар непосредственно у производителя, цена покупателя может превышать цену производителя на: a. сумму любого невычитаемого НДС, подлежащего уплате покупателем; и b. стоимость любых транспортных расходов на товар, оплаченных отдельно покупателем и не включенных в цену производителя. Из этого следует, что цена покупателя может превышать основную цену на величину двух упомянутых выше статей плюс стоимость любых налогов на продукты (за вычетом субсидий на продукты), кроме НДС.
source: Система национальных счетов 2008
  source: https://stat.semanticpro.org/xwiki/wiki/NationalAccounts/view/%D0%91%D0%B8%D0%B1%D0%BB%D0%B8%D0%BE%D1%82%D0%B5%D0%BA%D0%B0/%D0%A1%D0%B8%D1%81%D1%82%D0%B5%D0%BC%D0%B0%20%D0%BD%D0%B0%D1%86%D0%B8%D0%BE%D…
requires: Налог на добавленную стоимость
requires: Товары
requires: Налоги
requires: Услуги
term status: draft
broader: Цена
definition: The purchaser’s price is the amount paid by the purchaser, excluding any VAT or similar tax deductible by the purchaser, in order to take delivery of a unit of a good or service at the time and place required by the purchaser. The purchaser’s price of a good includes any transport charges paid separately by the purchaser to take delivery at the required time and place.
definition: Цена покупателя — это сумма, уплаченная покупателем, исключая любой НДС или аналогичный налог, которые подлежат вычитанию покупателем, за поставку единицы товара или услуги в установленные покупателем сроки и место. Цена покупателя товара включает любые транспортные расходы, оплаченные отдельно покупателем за поставку в установленные сроки и место.
example: Цены: Цена покупателя является конечной ценой потребления и включает в себя НДС, акциз и другие косвенные налоги, а также затраты и прибыль организаций товаропроводящей сети.
in scheme: Глоссарий
preferred label: Purchaser's Price
related: Налог на добавленную стоимость
related: Цена производителя
related: Товары
related: Субсидия на продукт
related: Основная цена
related: Налог на продукт
related: Невычитаемый НДС
top concept of: Глоссарий

Операция
type: Concept
source: Система национальных счетов 2008
  source: https://stat.semanticpro.org/xwiki/wiki/NationalAccounts/view/%D0%91%D0%B8%D0%B1%D0%BB%D0%B8%D0%BE%D1%82%D0%B5%D0%BA%D0%B0/%D0%A1%D0%B8%D1%81%D1%82%D0%B5%D0%BC%D0%B0%20%D0%BD%D0%B0%D1%86%D0%B8%D0%BE%D…
requires: Институциональная единица
requires: Экономические потоки
term status: draft
broader: Экономические потоки
definition: A transaction is an economic flow that is an interaction between institutional units by mutual agreement or an action within an institutional unit that it is analytically useful to treat like a transaction, often because the unit is operating in two different capacities.
definition: Операция — это экономический поток, представляющий собой взаимодействие между институциональными единицами по взаимному согласию или действие в рамках одной институциональной единицы, которое с аналитической точки зрения целесообразно рассматривать как операцию, часто ввиду того, что единица функционирует в двух различных качествах.
in scheme: Глоссарий
preferred label: Transaction
top concept of: Глоссарий

Страховое возмещение
type: Concept
source: Система национальных счетов 2008
  source: https://stat.semanticpro.org/xwiki/wiki/NationalAccounts/view/%D0%91%D0%B8%D0%B1%D0%BB%D0%B8%D0%BE%D1%82%D0%B5%D0%BA%D0%B0/%D0%A1%D0%B8%D1%81%D1%82%D0%B5%D0%BC%D0%B0%20%D0%BD%D0%B0%D1%86%D0%B8%D0%BE%D…
term status: draft
alternative label: Страховая выплата
definition: Страховое возмещение (страховая выплата) — это сумма, подлежащая выплате держателю страхового полиса прямым страховщиком или перестраховщиком в отношении страхового случая, предусмотренного полисом, который произошел в период действия полиса.
definition: The actual premium is the amount payable to the direct insurer or reinsurer to secure insurance cover for a specific event over a stated time period.
in scheme: Глоссарий
preferred label: Actual Premium
top concept of: Глоссарий

Страхование жизни
type: Concept
comment: The sum payable under the policy (benefit) may be fixed or may vary to reflect the income earned from the investment of premiums during the period for which the policy operates. For policies with varying returns, the terms “with-profits” life insurance or endowment policy are generally used. Although the date and sum may be variable, a claim is always paid in respect of a life policy.
comment: Сумма, подлежащая выплате в соответствии с полисом, может быть фиксированной или может меняться в зависимости от дохода, заработанного в результате инвестирования страховых премий в течение периода действия полиса. Для полисов с изменяющимся доходом обычно используются термины «полис страхования жизни с участием в прибылях» или «полис-вклад». В случае полиса страхования жизни страховое возмещение выплачивается всегда, хотя дата и сумма выплаты могут меняться.
source: Система национальных счетов 2008
  source: https://stat.semanticpro.org/xwiki/wiki/NationalAccounts/view/%D0%91%D0%B8%D0%B1%D0%BB%D0%B8%D0%BE%D1%82%D0%B5%D0%BA%D0%B0/%D0%A1%D0%B8%D1%81%D1%82%D0%B5%D0%BC%D0%B0%20%D0%BD%D0%B0%D1%86%D0%B8%D0%BE%D…
term status: draft
definition: Страхование жизни — это деятельность, при которой держатель страхового полиса производит регулярные платежи страховщику, в обмен на которые страховщик гарантирует держателю полиса (или в некоторых случаях другому назначенному лицу) выплату определенной суммы или аннуитета в определенный срок или до его наступления в случае смерти держателя полиса.
definition: Life insurance is an activity whereby a policyholder makes regular payments to an insurer in return for which the insurer guarantees to provide the policyholder (or in some cases another nominated person) with an agreed sum, or an annuity, at a given date or earlier if the policyholder dies beforehand.
in scheme: Глоссарий
preferred label: Life Insurance
related: Страховое возмещение
top concept of: Глоссарий

Рента
type: Concept
source: Система национальных счетов 2008
  source: https://stat.semanticpro.org/xwiki/wiki/NationalAccounts/view/%D0%91%D0%B8%D0%B1%D0%BB%D0%B8%D0%BE%D1%82%D0%B5%D0%BA%D0%B0/%D0%A1%D0%B8%D1%81%D1%82%D0%B5%D0%BC%D0%B0%20%D0%BD%D0%B0%D1%86%D0%B8%D0%BE%D…
requires: Институциональная единица
requires: Земля
requires: Производство
requires: Природные ресурсы
term status: draft
definition: Рента — это доход, получаемый собственником природного ресурса (арендодателем или собственником земли) за предоставление его в распоряжение другой институциональной единицы (арендополучателя или арендатора) для использования в производстве.
definition: Rent is the income receivable by the owner of a natural resource (the lessor or landlord) for putting the natural resource at the disposal of another institutional unit (a lessee or tenant) for use of the natural resource in production.
in scheme: Глоссарий
preferred label: Rent
top concept of: Глоссарий

Изменение чистой стоимости капитала вследствие сбережения и капитальных трансфертов
type: Concept
source: Система национальных счетов 2008
  source: https://stat.semanticpro.org/xwiki/wiki/NationalAccounts/view/%D0%91%D0%B8%D0%B1%D0%BB%D0%B8%D0%BE%D1%82%D0%B5%D0%BA%D0%B0/%D0%A1%D0%B8%D1%81%D1%82%D0%B5%D0%BC%D0%B0%20%D0%BD%D0%B0%D1%86%D0%B8%D0%BE%D…
requires: Финансовые активы
term status: draft
definition: Changes in net worth due to saving and capital transfers represent the positive or negative amount available to the unit or sector for the acquisition of non-financial and financial assets.
definition: Изменение чистой стоимости капитала вследствие сбережения и капитальных трансфертов представляет собой положительную или отрицательную сумму, имеющуюся в распоряжении единицы или сектора для приобретения нефинансовых и финансовых активов.
in scheme: Глоссарий
preferred label: Changes In Net Worth Due To Saving And Capital Transfers
top concept of: Глоссарий

Отчисления работодателей на социальное страхование
type: Concept
source: Система национальных счетов 2008
  source: https://stat.semanticpro.org/xwiki/wiki/NationalAccounts/view/%D0%91%D0%B8%D0%B1%D0%BB%D0%B8%D0%BE%D1%82%D0%B5%D0%BA%D0%B0/%D0%A1%D0%B8%D1%81%D1%82%D0%B5%D0%BC%D0%B0%20%D0%BD%D0%B0%D1%86%D0%B8%D0%BE%D…
requires: Программа социального страхования
requires: Социальные пособия
term status: draft
definition: Отчисления работодателей на социальное страхование представляют собой отчисления, подлежащие уплате работодателями в фонды социального обеспечения или другие программы социального страхования, связанные с занятостью, с целью обеспечения выплат социальных пособий их наемным работникам.
definition: Employers’ social contributions are social contributions payable by employers to social security funds or other employment-related social insurance schemes to secure social benefits for their employees.
in scheme: Глоссарий
preferred label: Employers’ Social Contributions
top concept of: Глоссарий

Налоги
type: Concept
comment: Они являются трансфертами, поскольку отдельная единица, уплачивающая налог, не получает взамен от органов государственного управления никакого эквивалента, хотя последние и предоставляют товары или услуги обществу в целом или другим отдельным единицам, или группам единиц в зависимости от их общей экономической и социальной политики. Текущие налоги на доходы, имущество и т. д. состоят, в основном, из налогов, взимаемых с доходов домашних хозяйств и корпораций. Они представляют собой выплаты из доходов и отражаются на стороне использования счета вторичного распределения доходов для секторов домашних хозяйств и корпораций. Эти налоги могут так же подлежать уплате нерезидентами и, возможно, органами государственного управления или <a target="_blank" rel="noopener noreferrer" href="https://stat.semanticpro.org/xwiki/wiki/NationalAccounts/view/%D0%93%D0%BB%D0%BE%D1%81%D1%81%D0%B0%D1%80%D0%B8%D0%B8/%D0%9D%D0%B5%D0%BA%D0%BE%D0%BC%D0%BC%D0%B5%D1%80%D1%87%D0%B5%D1%81%D0%BA%D0%B8%D0%B5%20%D0%BE%D1%80%D0%B3%D0%B0%D0%BD%D0%B8%D0%B7%D0%B0%D1%86%D0%B8%D0%B8%2C%20%D0%BE%D0%B1%D1%81%D0%BB%D1%83%D0%B6%D0%B8%D0%B2%D0%B0%D1%8E%D1%89%D0%B8%D0%B5%20%D0%B4%D0%BE%D0%BC%D0%B0%D1%88%D0%BD%D0%B8%D0%B5%20%D1%85%D0%BE%D0%B7%D1%8F%D0%B9%D1%81%D1%82%D0%B2%D0%B0/">НКОДХ. В прошлом текущие налоги на доходы, имущество и т. д. назывались «прямыми налогами», но, как пояснено в главе 7, термины «прямой налог» и «косвенный налог» больше не используются в СНС. Эти налоги нельзя называть просто «текущими налогами на доходы и имущество», поскольку они включают некоторые периодические налоги с домашних хозяйств, которыми не облагаются ни доходы, ни имущество домашнего хозяйства или его членов, например, подушные налоги.
source: Система национальных счетов 2008
  source: https://stat.semanticpro.org/xwiki/wiki/NationalAccounts/view/%D0%91%D0%B8%D0%B1%D0%BB%D0%B8%D0%BE%D1%82%D0%B5%D0%BA%D0%B0/%D0%A1%D0%B8%D1%81%D1%82%D0%B5%D0%BC%D0%B0%20%D0%BD%D0%B0%D1%86%D0%B8%D0%BE%D…
requires: Институциональная единица
requires: Органы государственного управления
term status: draft
definition: Налоги — это обязательные безвозмездные выплаты в денежной или натуральной форме, производимые институциональными единицами органам государственного управления.
definition: Taxes are compulsory, unrequited payments, in cash or in kind, made by institutional units to government units.
in scheme: Глоссарий
preferred label: Taxes
related: Некоммерческие организации, обслуживающие домашние хозяйства
related: Товары
related: Трансферт
related: Корпорация
related: Домашнее хозяйство
related: Органы государственного управления
related: Услуги
top concept of: Глоссарий

Некорпорированное предприятие
type: Concept
source: Система национальных счетов 2008
  source: https://stat.semanticpro.org/xwiki/wiki/NationalAccounts/view/%D0%91%D0%B8%D0%B1%D0%BB%D0%B8%D0%BE%D1%82%D0%B5%D0%BA%D0%B0/%D0%A1%D0%B8%D1%81%D1%82%D0%B5%D0%BC%D0%B0%20%D0%BD%D0%B0%D1%86%D0%B8%D0%BE%D…
requires: Некоммерческие организации, обслуживающие домашние хозяйства
requires: Квазикорпорация
requires: Домашнее хозяйство
requires: Органы государственного управления
requires: Производство
term status: draft
definition: An unincorporated enterprise represents the production activity of a government unit, NPISH or household that cannot be treated as the production activity of a quasi-corporation.
definition: Некорпорированное предприятие представляет собой производственную деятельность органов государственного управления, <a target="_blank" rel="noopener noreferrer" href="https://stat.semanticpro.org/xwiki/wiki/NationalAccounts/view/%D0%93%D0%BB%D0%BE%D1%81%D1%81%D0%B0%D1%80%D0%B8%D0%B8/%D0%9D%D0%B5%D0%BA%D0%BE%D0%BC%D0%BC%D0%B5%D1%80%D1%87%D0%B5%D1%81%D0%BA%D0%B8%D0%B5%20%D0%BE%D1%80%D0%B3%D0%B0%D0%BD%D0%B8%D0%B7%D0%B0%D1%86%D0%B8%D0%B8%2C%20%D0%BE%D0%B1%D1%81%D0%BB%D1%83%D0%B6%D0%B8%D0%B2%D0%B0%D1%8E%D1%89%D0%B8%D0%B5%20%D0%B4%D0%BE%D0%BC%D0%B0%D1%88%D0%BD%D0%B8%D0%B5%20%D1%85%D0%BE%D0%B7%D1%8F%D0%B9%D1%81%D1%82%D0%B2%D0%B0/">НКОДХ или домашнего хозяйства, которая не может рассматриваться как производственная деятельность квазикорпорации.
in scheme: Глоссарий
preferred label: Unincorporated Enterprise
top concept of: Глоссарий

Невычитаемый НДС
type: Concept
source: Система национальных счетов 2008
  source: https://stat.semanticpro.org/xwiki/wiki/NationalAccounts/view/%D0%91%D0%B8%D0%B1%D0%BB%D0%B8%D0%BE%D1%82%D0%B5%D0%BA%D0%B0/%D0%A1%D0%B8%D1%81%D1%82%D0%B5%D0%BC%D0%B0%20%D0%BD%D0%B0%D1%86%D0%B8%D0%BE%D…
requires: Налог на добавленную стоимость
requires: Обязательство
term status: draft
broader: Налог на добавленную стоимость
definition: Non-deductible VAT is VAT payable by a purchaser that is not deductible from his own VAT liability, if any.
definition: Невычитаемый НДС — это НДС, подлежащий уплате покупателем, который не вычитается из его собственного обязательства по НДС, если оно существует.
in scheme: Глоссарий
preferred label: Non-Deductible VAT
top concept of: Глоссарий

Валовой национальный располагаемый доход
type: Concept
comment: В большинстве случаев текущие трансферты, будь то в денежной или натуральной форме, могут происходить между институциональными единицами-резидентами и нерезидентами, а также между единицами-резидентами.
source: Система национальных счетов 2008
  source: https://stat.semanticpro.org/xwiki/wiki/NationalAccounts/view/%D0%91%D0%B8%D0%B1%D0%BB%D0%B8%D0%BE%D1%82%D0%B5%D0%BA%D0%B0/%D0%A1%D0%B8%D1%81%D1%82%D0%B5%D0%BC%D0%B0%20%D0%BD%D0%B0%D1%86%D0%B8%D0%BE%D…
requires: Институциональная единица
requires: Чистый национальный доход
requires: Текущий трансферт
term status: draft
definition: Валовой (чистый) национальный располагаемый доход может быть получен путем добавления к валовому или чистому национальному доходу всех текущих трансфертов в денежной или натуральной форме, подлежащих получению институциональными единицами — резидентами данной страны от нерезидентов, и вычитания всех текущих трансфертов в денежной или натуральной форме, подлежащих выплате институциональными единицами — резидентами данной страны нерезидентам.
definition: Gross or net national disposable income may be derived from gross or net national income by adding all current transfers in cash or in kind receivable by resident institutional units from non-resident units; and subtracting all current transfers in cash or in kind payable by resident institutional units to non-resident units.
in scheme: Глоссарий
preferred label: Gross or Net National Disposable Income
related: Институциональная единица
related: Текущий трансферт
top concept of: Глоссарий

Ресурсы деревьев, сельскохозяйственных культур и насаждений
type: Concept
comment: Они включают деревья (в том числе — виноградные лозы и кусты), выращиваемые для получения фруктов и орехов, сока и смолы и продуктов из коры и листьев. Деревья, выращенные для получения древесины, которые дают готовый продукт лишь однажды, когда они срублены, не являются основными фондами, так же как зерновые культуры или овощи, которые позволяют собрать один единственный урожай, не могут быть отнесены к основным фондам.
comment: They include trees (including vines and shrubs) cultivated for fruits and nuts, for sap and resin and for bark and leaf products. Trees grown for timber that yield a finished product once only when they are ultimately felled are not fixed assets, just as cereals or vegetables that produce only a single crop when they are harvested cannot be fixed assets.
source: Система национальных счетов 2008
  source: https://stat.semanticpro.org/xwiki/wiki/NationalAccounts/view/%D0%91%D0%B8%D0%B1%D0%BB%D0%B8%D0%BE%D1%82%D0%B5%D0%BA%D0%B0/%D0%A1%D0%B8%D1%81%D1%82%D0%B5%D0%BC%D0%B0%20%D0%BD%D0%B0%D1%86%D0%B8%D0%BE%D…
requires: Продукты
requires: Институциональная единица
term status: draft
definition: Tree, crop and plant resources yielding repeat products cover plants whose natural growth and regeneration are under the direct control, responsibility and management of institutional units.
definition: Ресурсы деревьев, сельскохозяйственных культур и насаждений, приносящих продукцию на регулярной основе, охватывают растения, естественный рост и воспроизводство которых находятся под непосредственным контролем, ответственностью и управлением институциональных единиц.
in scheme: Глоссарий
preferred label: Tree, Crop and Plant Resources
related: Продукты
related: Готовые продукты
top concept of: Глоссарий

Другие продукты интеллектуальной собственности
type: Concept
source: Система национальных счетов 2008
  source: https://stat.semanticpro.org/xwiki/wiki/NationalAccounts/view/%D0%91%D0%B8%D0%B1%D0%BB%D0%B8%D0%BE%D1%82%D0%B5%D0%BA%D0%B0/%D0%A1%D0%B8%D1%81%D1%82%D0%B5%D0%BC%D0%B0%20%D0%BD%D0%B0%D1%86%D0%B8%D0%BE%D…
requires: Продукты
requires: База данных
requires: Разведка и оценка запасов полезных ископаемых
requires: Компьютерное программное обеспечение
requires: Научные исследования и разработки
term status: draft
definition: Other intellectual property products include any such products that constitute fixed assets but are not captured as research and development, mineral exploration and evaluation, computer software and databases or entertainment, literary and artistic originals.
definition: Другие продукты интеллектуальной собственности включают такие продукты, которые являются основными фондами, но не были включены ни в одну из других статей данной категории (научные исследования и разработки, <a target="_blank" rel="noopener noreferrer" href="https://stat.semanticpro.org/xwiki/wiki/NationalAccounts/view/%D0%93%D0%BB%D0%BE%D1%81%D1%81%D0%B0%D1%80%D0%B8%D0%B8/%D0%A0%D0%B0%D0%B7%D0%B2%D0%B5%D0%B4%D0%BA%D0%B0%20%D0%B8%20%D0%BE%D1%86%D0%B5%D0%BD%D0%BA%D0%B0%20%D0%B7%D0%B0%D0%BF%D0%B0%D1%81%D0%BE%D0%B2%20%D0%BF%D0%BE%D0%BB%D0%B5%D0%B7%D0%BD%D1%8B%D1%85%20%D0%B8%D1%81%D0%BA%D0%BE%D0%BF%D0%B0%D0%B5%D0%BC%D1%8B%D1%85/">разведка и оценка запасов полезных ископаемых, компьютерное программное обеспечение и базы данных, оригиналы развлекательных, литературных и художественных произведений).
in scheme: Глоссарий
preferred label: Other Intellectual Property Products
top concept of: Глоссарий

Инвестиционные фонды неденежного рынка
type: Concept
comment: Акции или паи инвестиционного фонда обычно не являются близкими аналогами депозитов. Они не могут передаваться с помощью чеков или прямых платежей третьими лицами. Инвестиционные фонды неденежного рынка обычно инвестируют в долгосрочные финансовые активы и, возможно, в недвижимое имущество. Такие инструменты обычно не являются переводимыми и не рассматриваются как аналоги депозитов.
source: Система национальных счетов 2008
  source: https://stat.semanticpro.org/xwiki/wiki/NationalAccounts/view/%D0%91%D0%B8%D0%B1%D0%BB%D0%B8%D0%BE%D1%82%D0%B5%D0%BA%D0%B0/%D0%A1%D0%B8%D1%81%D1%82%D0%B5%D0%BC%D0%B0%20%D0%BD%D0%B0%D1%86%D0%B8%D0%BE%D…
requires: Финансовые активы
requires: Население
requires: Выпуск
requires: Актив
term status: draft
alternative label: Non-Money-Market (MMF) Investment Funds
broader: Инвестиционные фонды
definition: Инвестиционные фонды неденежного рынка представляют собой коллективные инвестиционные программы, которые привлекают средства населения путем выпуска акций или паев. Полученные средства инвестируются, главным образом, в финансовые активы, кроме краткосрочных активов, и в нефинансовые активы (обычно в недвижимость).
definition: Non-money-market (MMF) investment funds are collective investment schemes that raise funds by issuing shares or units to the public. The proceeds are invested predominantly in financial assets other than short-term assets and in non-financial assets (usually real estate).
in scheme: Глоссарий
preferred label: Non-Money-Market Investment Funds
related: Актив
top concept of: Глоссарий

Начисленный НДС
type: Concept
source: Система национальных счетов 2008
  source: https://stat.semanticpro.org/xwiki/wiki/NationalAccounts/view/%D0%91%D0%B8%D0%B1%D0%BB%D0%B8%D0%BE%D1%82%D0%B5%D0%BA%D0%B0/%D0%A1%D0%B8%D1%81%D1%82%D0%B5%D0%BC%D0%B0%20%D0%BD%D0%B0%D1%86%D0%B8%D0%BE%D…
requires: Налог на добавленную стоимость
term status: draft
broader: Налог на добавленную стоимость
definition: Начисленный НДС — это НДС, подлежащий уплате на продажи производителем; он показывается отдельно в счетах-фактурах, представленных производителем покупателю.
definition: Invoiced VAT is the VAT payable on the sales of a producer. It is shown separately on the invoice that the producer presents to the purchaser.
in scheme: Глоссарий
preferred label: Invoiced VAT
top concept of: Глоссарий

Основная деятельность
type: Concept
comment: Основная деятельность предприятия включает основной продукт и любые побочные продукты (продукты, неизбежно получаемые вместе с основным продуктом). Выпуск, создаваемый в процессе основной деятельности, должен состоять из товаров и услуг, которые могут быть поставлены другим единицам, включая те, которые используются для собственного потребления или собственного накопления.
source: Система национальных счетов 2008
  source: https://stat.semanticpro.org/xwiki/wiki/NationalAccounts/view/%D0%91%D0%B8%D0%B1%D0%BB%D0%B8%D0%BE%D1%82%D0%B5%D0%BA%D0%B0/%D0%A1%D0%B8%D1%81%D1%82%D0%B5%D0%BC%D0%B0%20%D0%BD%D0%B0%D1%86%D0%B8%D0%BE%D…
term status: draft
broader: Производство
definition: Основная деятельность характеризуется тем, что созданная в ее процессе добавленная стоимость больше добавленной стоимости любой другой деятельности, выполняемой той же самой единицей.
definition: The principal activity of a producer unit is the activity whose value added exceeds that of any other activity carried out within the same unit.
in scheme: Глоссарий
preferred label: Principal Activity
related: Предприятие
related: Продукты
related: Товары
related: Потребление
related: Выпуск
related: Услуги
top concept of: Глоссарий

Облигации и долговые обязательства
type: Concept
comment: Обязательство возникает, когда одна единица (дебитор) обязуется при определенных обстоятельствах произвести платеж или ряд платежей другой единице (кредитору).
comment: A liability is established when one unit (the debtor) is obliged, under specific circumstances, to provide a payment or series of payments to another unit (the creditor).
source: Система национальных счетов 2008
  source: https://stat.semanticpro.org/xwiki/wiki/NationalAccounts/view/%D0%91%D0%B8%D0%B1%D0%BB%D0%B8%D0%BE%D1%82%D0%B5%D0%BA%D0%B0/%D0%A1%D0%B8%D1%81%D1%82%D0%B5%D0%BC%D0%B0%20%D0%BD%D0%B0%D1%86%D0%B8%D0%BE%D…
requires: Ценные бумаги
requires: Процент
term status: draft
definition: Облигации и долговые обязательства представляют собой ценные бумаги, которые обеспечивают их держателям безусловное право на получение фиксированных платежей или предусмотренной в контракте некоторой непостоянной суммы платежей, то есть получение процентов не зависит от доходов дебиторов.
definition: Bonds and debentures are securities that give the holders the unconditional right to fixed payments or contractually determined variable payments, that is, the earning of interest is not dependent on earnings of the debtors.
in scheme: Глоссарий
preferred label: Bonds and Debentures
top concept of: Глоссарий

Контракты, договоры аренды и лицензии
type: Concept
comment: Условия контракта, договора аренды или лицензии определяют цену за использование актива или за предоставление услуги, которая отличается от цены, которая преобладала бы в отсутствие контракта, договора аренды или лицензии. Одна из сторон контракта должна быть в состоянии юридически и практически реализовать эту разницу в ценах.
source: Система национальных счетов 2008
  source: https://stat.semanticpro.org/xwiki/wiki/NationalAccounts/view/%D0%91%D0%B8%D0%B1%D0%BB%D0%B8%D0%BE%D1%82%D0%B5%D0%BA%D0%B0/%D0%A1%D0%B8%D1%81%D1%82%D0%B5%D0%BC%D0%B0%20%D0%BD%D0%B0%D1%86%D0%B8%D0%BE%D…
requires: Актив
term status: draft
broader: Непроизведенные активы
definition: Contracts, leases and licences are treated as assets only when both the following conditions are satisfied. The terms of the contract, lease or licence specify a price for the use of an asset or provision of a service that differs from the price that would prevail in the absence of the contract, lease or licence. One party to the contract must be able legally and practically to realize this price difference.
definition: Контракты, договоры аренды и лицензии рассматриваются как активы только при одновременном соблюдении двух условий.
in scheme: Глоссарий
preferred label: Contracts, Leases and Licences
related: Цена
related: Актив
related: Услуги
top concept of: Глоссарий

Жилые здания
type: Concept
comment: Плавучие дома, баржи, передвижные дома и автоприцепы также включаются в эту категорию, если они являются основным местом проживания для членов домашних хозяйств; также включаются и исторические памятники, если их можно идентифицировать, в первую очередь, как жилые здания. Примерами являются продукты, включенные в CPC-2 в класс 5311, жилые дома, и часть группы 387. Первый класс включает отдельные и многоквартирные жилые здания, а также муниципальные жилые дома, дома для престарелых, общежития, приюты и т. д. Последний класс включает сборные здания, предназначенные для жилья, и строения, связанные с жилыми домами, такие как гаражи. Незавершенные производством жилые здания включаются в той мере, в которой окончательный пользователь может рассматриваться как получивший право собственности, либо потому что строительство осуществляется для собственного использования, либо если право собственности засвидетельствовано существующим договором купли-продажи. Жилые здания, приобретенные для военнослужащих, включаются, потому что они используются для производства жилищных услуг таким же образом, как жилые здания, приобретенные гражданскими лицами.
source: Система национальных счетов 2008
  source: https://stat.semanticpro.org/xwiki/wiki/NationalAccounts/view/%D0%91%D0%B8%D0%B1%D0%BB%D0%B8%D0%BE%D1%82%D0%B5%D0%BA%D0%B0/%D0%A1%D0%B8%D1%81%D1%82%D0%B5%D0%BC%D0%B0%20%D0%BD%D0%B0%D1%86%D0%B8%D0%BE%D…
term status: draft
definition: Жилые здания — это здания или определенные части зданий, которые используются полностью или преимущественно как места проживания, включая любые вспомогательные помещения, такие как гаражи, и всю постоянную арматуру, обычно устанавливаемую в местах проживания.
definition: Dwellings are buildings, or designated parts of buildings, that are used entirely or primarily as residences, including any associated structures, such as garages, and all permanent fixtures customarily installed in residences
example: Строительство и инвестиции в основной капитал: Жилым считается здание, рассчитанное на длительный срок службы, не менее половины площади которого предназначено для постоянного проживания людей, расположенное на земельном участке в определенных границах со всеми находящимися на нем вспомогательными сооружениями и элементами благоустройства.
in scheme: Глоссарий
preferred label: Dwellings
related: Продукты
related: Домашнее хозяйство
related: Незавершенное производство
related: Исторические памятники
related: Производство
related: Услуги
top concept of: Глоссарий

Фонды денежного рынка
type: Concept
source: Система национальных счетов 2008
  source: https://stat.semanticpro.org/xwiki/wiki/NationalAccounts/view/%D0%91%D0%B8%D0%B1%D0%BB%D0%B8%D0%BE%D1%82%D0%B5%D0%BA%D0%B0/%D0%A1%D0%B8%D1%81%D1%82%D0%B5%D0%BC%D0%B0%20%D0%BD%D0%B0%D1%86%D0%B8%D0%BE%D…
requires: Население
term status: draft
alternative label: ФДР
alternative label: Money Market Funds (MMFs)
broader: Инвестиционные фонды
definition: Фонды денежного рынка (ФДР) представляют собой коллективные инвестиционные программы, которые аккумулируют средства путем продажи акций или паев населению. Полученные средства инвестируются, главным образом, в инструменты денежного рынка, акции или паи ФДР, переводимые долговые инструменты с оставшимися сроками погашения не более одного года, банковские депозиты и инструменты, которые имеют целью получить норму дохода, которая близка к процентной ставке инструментов денежного рынка. Акции ФДР могут быть переданы с помощью чеков или других видов прямых платежей третьей стороной.
definition: Money market funds (MMFs) are collective investment schemes that raise funds by issuing shares or units to the public. The proceeds are invested primarily in money market instruments, MMF shares/units, transferable debt instruments with a residual maturity of not more than one year, bank deposits and instruments that pursue a rate of return that approaches the interest rates of money market instruments. MMF shares can be transferred by cheque or other means of direct third- party payment.
in scheme: Глоссарий
preferred label: Money Market Funds
top concept of: Глоссарий

Отчисления на социальное страхование
type: Concept
comment: Они могут производиться работодателями от имени своих наемных работников. Они формируют часть оплаты труда и включаются в сальдо первичных доходов домашних хозяйств. В счете вторичного распределения доходов эти отчисления вместе с платежами, производимыми самими домашними хозяйствами, выступающими в качестве наемных работников, самостоятельно занятых лиц или безработных, отражаются как подлежащие выплате домашними хозяйствами и подлежащие получению единицами, ответственными за программы социального страхования. Отчисления на социальное страхование могут быть получены единицами в любом секторе, обеспечивающими программы социального страхования своим наемным работникам (даже в редких случаях домашними хозяйствами, если в качестве некорпорированных предприятий они организуют программы социального страхования для своих наемных работников) или единицей третьей стороны, определенной как организация, ответственная за управление программой. Вместе с тем, в большинстве случаев такие отчисления отражаются, как правило, на стороне ресурсов счета для сектора государственного управления, включая фонды социального обеспечения, а также счета для сектора финансовых корпораций в части страховых корпораций и пенсионных фондов. На стороне использования отчисления на социальное страхование отражаются только для домашних хозяйств, как резидентов, так и нерезидентов.
source: Система национальных счетов 2008
  source: https://stat.semanticpro.org/xwiki/wiki/NationalAccounts/view/%D0%91%D0%B8%D0%B1%D0%BB%D0%B8%D0%BE%D1%82%D0%B5%D0%BA%D0%B0/%D0%A1%D0%B8%D1%81%D1%82%D0%B5%D0%BC%D0%B0%20%D0%BD%D0%B0%D1%86%D0%B8%D0%BE%D…
requires: Программа социального страхования
requires: Пособие по социальному страхованию
term status: draft
definition: Social contributions are actual or imputed payments to social insurance schemes to make provision for social insurance benefits to be paid.
definition: Отчисления на социальное страхование — это фактические или условно исчисленные платежи в программы социального страхования для обеспечения средств, необходимых для выплаты пособий по социальному страхованию.
in scheme: Глоссарий
preferred label: Social Contributions
related: Предприятие
related: Финансовые корпорации
related: Оплата труда
related: Корпорация
related: Программа социального страхования
related: Сальдо первичных доходов
related: Домашнее хозяйство
related: Самостоятельно занятые лица
top concept of: Глоссарий

Текущие трансферты в рамках сектора государственного управления
type: Concept
comment: Они включают текущие трансферты между разными уровнями государственного управления (часто имеющие место между центральными и региональными или местными органами государственного управления), а также между органами государственного управления и фондами социального обеспечения. Они не включают трансфертов средств, выделяемых для финансирования валового накопления основного капитала; такие трансферты рассматриваются как капитальные трансферты.
source: Система национальных счетов 2008
  source: https://stat.semanticpro.org/xwiki/wiki/NationalAccounts/view/%D0%91%D0%B8%D0%B1%D0%BB%D0%B8%D0%BE%D1%82%D0%B5%D0%BA%D0%B0/%D0%A1%D0%B8%D1%81%D1%82%D0%B5%D0%BC%D0%B0%20%D0%BD%D0%B0%D1%86%D0%B8%D0%BE%D…
requires: Текущий трансферт
term status: draft
broader: Текущий трансферт
definition: Текущие трансферты в рамках сектора государственного управления включают текущие трансферты между различными единицами сектора государственного управления.
definition: Current transfers within general government consist of current transfers between different government units.
in scheme: Глоссарий
preferred label: Current Transfers Within General Government
related: Валовое накопление основного капитала
related: Трансферт
related: Текущий трансферт
related: Капитальные трансферты
related: Органы государственного управления
top concept of: Глоссарий

Культивируемые биологические ресурсы
type: Concept
comment: В случае специализированных производителей животные или деревья, выращивание которых еще не завершено, и они не готовы для продажи или поставки, отражаются как незавершенное производство. Однако, когда животные или деревья, которые предполагается использовать в качестве основных фондов, производятся фермерами или другими лицами для собственного использования, незавершенные активы в виде животных, деревьев и т. д., не достигших продуктивного возраста, которые не готовы для использования в производстве, рассматриваются не как незавершенное производство, а как валовое накопление основного капитала производителя, являющегося конечным пользователем.
source: Система национальных счетов 2008
  source: https://stat.semanticpro.org/xwiki/wiki/NationalAccounts/view/%D0%91%D0%B8%D0%B1%D0%BB%D0%B8%D0%BE%D1%82%D0%B5%D0%BA%D0%B0/%D0%A1%D0%B8%D1%81%D1%82%D0%B5%D0%BC%D0%B0%20%D0%BD%D0%B0%D1%86%D0%B8%D0%BE%D…
requires: Ресурсы деревьев, сельскохозяйственных культур и насаждений
requires: Ресурсы животных
requires: Продукты
requires: Институциональная единица
term status: draft
definition: Культивируемые биологические ресурсы охватывают ресурсы животных, приносящих продукцию на регулярной основе, и <a target="_blank" rel="noopener noreferrer" href="https://stat.semanticpro.org/xwiki/wiki/NationalAccounts/view/%D0%93%D0%BB%D0%BE%D1%81%D1%81%D0%B0%D1%80%D0%B8%D0%B8/%D0%A0%D0%B5%D1%81%D1%83%D1%80%D1%81%D1%8B%20%D0%B4%D0%B5%D1%80%D0%B5%D0%B2%D1%8C%D0%B5%D0%B2%2C%20%D1%81%D0%B5%D0%BB%D1%8C%D1%81%D0%BA%D0%BE%D1%85%D0%BE%D0%B7%D1%8F%D0%B9%D1%81%D1%82%D0%B2%D0%B5%D0%BD%D0%BD%D1%8B%D1%85%20%D0%BA%D1%83%D0%BB%D1%8C%D1%82%D1%83%D1%80%20%D0%B8%20%D0%BD%D0%B0%D1%81%D0%B0%D0%B6%D0%B4%D0%B5%D0%BD%D0%B8%D0%B9/">ресурсы деревьев, сельскохозяйственных культур и насаждений, приносящих продукцию на регулярной основе, естественный рост и воспроизводство которых находятся под непосредственным контролем, ответственностью и управлением институциональных единиц.
definition: Cultivated biological resources cover animal resources yielding repeat products and tree, crop and plant resources yielding repeat products whose natural growth and regeneration is under the direct control, responsibility and management of an institutional unit.
in scheme: Глоссарий
preferred label: Cultivated Biological Resources
related: Валовое накопление основного капитала
related: Незавершенное производство
related: Актив
related: Производство
top concept of: Глоссарий

Страхование, кроме страхования жизни
type: Concept
source: Система национальных счетов 2008
  source: https://stat.semanticpro.org/xwiki/wiki/NationalAccounts/view/%D0%91%D0%B8%D0%B1%D0%BB%D0%B8%D0%BE%D1%82%D0%B5%D0%BA%D0%B0/%D0%A1%D0%B8%D1%81%D1%82%D0%B5%D0%BC%D0%B0%20%D0%BD%D0%B0%D1%86%D0%B8%D0%BE%D…
requires: Страхование жизни
term status: draft
definition: Страхование, кроме страхования жизни — это деятельность, аналогичная страхованию жизни, за исключением того, что она охватывает страхование от всех прочих рисков: несчастных случаев, заболевания, пожара и т. д.
definition: Non-life insurance claims are the amounts payable in settlement of damages that result from an event covered by a non-life insurance policy during the current accounting period.
in scheme: Глоссарий
preferred label: Non-Life Insurance
top concept of: Глоссарий

Потребительские товары и услуги
type: Concept
comment: В случае товаров различие между приобретением и потреблением является очевидным. Производители приобретают товары, которые они могут хранить на протяжении различных периодов времени, прежде чем физически израсходовать их в процессе производства. Домашние хозяйства могут хранить потребительские товары до того, как использовать их для удовлетворения своих потребностей или желаний. Только небольшое число товаров являются настолько скоропортящимися, что они должны использоваться немедленно. Например, большинство продовольственных товаров не требуется потреблять немедленно после того, как они были приобретены. В случае услуг, однако, различие между приобретением и использованием может не иметь практического смысла. Положение единиц, которым предоставлены услуги, может автоматически зависеть от предоставленных услуг, и какие-либо дальнейшие действия могут не потребоваться, чтобы от услуг была получена выгода.
source: Система национальных счетов 2008
  source: https://stat.semanticpro.org/xwiki/wiki/NationalAccounts/view/%D0%91%D0%B8%D0%B1%D0%BB%D0%B8%D0%BE%D1%82%D0%B5%D0%BA%D0%B0/%D0%A1%D0%B8%D1%81%D1%82%D0%B5%D0%BC%D0%B0%20%D0%BD%D0%B0%D1%86%D0%B8%D0%BE%D…
requires: Некоммерческие организации, обслуживающие домашние хозяйства
requires: Товары
requires: Домашнее хозяйство
requires: Органы государственного управления
requires: Услуги
requires: Производство
term status: draft
definition: Потребительский товар или услуга определяются как товар или услуга, которые используются (без дальнейшей переработки в производстве, как оно определено в СНС) домашними хозяйствами, <a target="_blank" rel="noopener noreferrer" href="https://stat.semanticpro.org/xwiki/wiki/NationalAccounts/view/%D0%93%D0%BB%D0%BE%D1%81%D1%81%D0%B0%D1%80%D0%B8%D0%B8/%D0%9D%D0%B5%D0%BA%D0%BE%D0%BC%D0%BC%D0%B5%D1%80%D1%87%D0%B5%D1%81%D0%BA%D0%B8%D0%B5%20%D0%BE%D1%80%D0%B3%D0%B0%D0%BD%D0%B8%D0%B7%D0%B0%D1%86%D0%B8%D0%B8%2C%20%D0%BE%D0%B1%D1%81%D0%BB%D1%83%D0%B6%D0%B8%D0%B2%D0%B0%D1%8E%D1%89%D0%B8%D0%B5%20%D0%B4%D0%BE%D0%BC%D0%B0%D1%88%D0%BD%D0%B8%D0%B5%20%D1%85%D0%BE%D0%B7%D1%8F%D0%B9%D1%81%D1%82%D0%B2%D0%B0/">НКОДХ или органами государственного управления для прямого удовлетворения индивидуальных потребностей (или желаний) либо коллективных потребностей членов общества в целом.
definition: A consumption good or service is defined as a good or service that is used (without further transformation in production as defined in the SNA) by households, NPISHs or government units for the direct satisfaction of individual needs (or wants) or for the collective needs of members of the community
example: Уровень и условия жизни: В разделе «Уровень и условия жизни» применяется только к домохозяйствам и отражает личный характер потребления.
in scheme: Глоссарий
preferred label: Consumption Good Or Service
related: Товары
related: Потребление
related: Домашнее хозяйство
related: Производство
related: Услуги
top concept of: Глоссарий

Товары или услуги индивидуального потребления
type: Concept
source: Система национальных счетов 2008
  source: https://stat.semanticpro.org/xwiki/wiki/NationalAccounts/view/%D0%91%D0%B8%D0%B1%D0%BB%D0%B8%D0%BE%D1%82%D0%B5%D0%BA%D0%B0/%D0%A1%D0%B8%D1%81%D1%82%D0%B5%D0%BC%D0%B0%20%D0%BD%D0%B0%D1%86%D0%B8%D0%BE%D…
requires: Товары
requires: Домашнее хозяйство
requires: Услуги
term status: draft
broader: Товары
broader: Услуги
definition: Товары или услуги индивидуального потребления — это товары или услуги, которые приобретены домашним хозяйством и используются для удовлетворения потребностей или желаний членов этого домашнего хозяйства.
definition: An individual consumption good or service is one that is acquired by a household and used to satisfy the needs or wants of members of that household.
in scheme: Глоссарий
preferred label: Individual Consumption Good Or Service
top concept of: Глоссарий

Акции, включенные в листинг
type: Concept
comment: Они также называются акциями, котируемыми на фондовой бирже. Наличие котировок цен на акции, включенные в листинг, означает наличие рыночных цен для них.
source: Система национальных счетов 2008
  source: https://stat.semanticpro.org/xwiki/wiki/NationalAccounts/view/%D0%91%D0%B8%D0%B1%D0%BB%D0%B8%D0%BE%D1%82%D0%B5%D0%BA%D0%B0/%D0%A1%D0%B8%D1%81%D1%82%D0%B5%D0%BC%D0%B0%20%D0%BD%D0%B0%D1%86%D0%B8%D0%BE%D…
requires: Ценные бумаги
term status: draft
preferred label: Listed Shares
definition: Listed shares are equity securities listed on an exchange.
definition: Акции, включенные в листинг — это ценные бумаги в форме акций, зарегистрированные на фондовой бирже.
in scheme: Глоссарий
related: Цена
related: MarketPrice
top concept of: Глоссарий

Выплаты компенсаций
type: Concept
comment: Выплата компенсаций может быть либо обязательной по решению судебных инстанций, либо в виде денежного возмещения, согласованного вне суда. В рассматриваемую категорию входят компенсации за ущерб или травмы, нанесенные другими институциональными единицами. Эта статья охватывает также денежные компенсации, предоставляемые органами государственного управления или <a target="_blank" rel="noopener noreferrer" href="https://stat.semanticpro.org/xwiki/wiki/NationalAccounts/view/%D0%93%D0%BB%D0%BE%D1%81%D1%81%D0%B0%D1%80%D0%B8%D0%B8/%D0%9D%D0%B5%D0%BA%D0%BE%D0%BC%D0%BC%D0%B5%D1%80%D1%87%D0%B5%D1%81%D0%BA%D0%B8%D0%B5%20%D0%BE%D1%80%D0%B3%D0%B0%D0%BD%D0%B8%D0%B7%D0%B0%D1%86%D0%B8%D0%B8%2C%20%D0%BE%D0%B1%D1%81%D0%BB%D1%83%D0%B6%D0%B8%D0%B2%D0%B0%D1%8E%D1%89%D0%B8%D0%B5%20%D0%B4%D0%BE%D0%BC%D0%B0%D1%88%D0%BD%D0%B8%D0%B5%20%D1%85%D0%BE%D0%B7%D1%8F%D0%B9%D1%81%D1%82%D0%B2%D0%B0/">НКОДХ за травмы или ущерб, причиненные другими институциональными единицами, и выплаты органами государственного управления компенсаций за травмы и ущерб, вызванные стихийными бедствиями.
source: Система национальных счетов 2008
  source: https://stat.semanticpro.org/xwiki/wiki/NationalAccounts/view/%D0%91%D0%B8%D0%B1%D0%BB%D0%B8%D0%BE%D1%82%D0%B5%D0%BA%D0%B0/%D0%A1%D0%B8%D1%81%D1%82%D0%B5%D0%BC%D0%B0%20%D0%BD%D0%B0%D1%86%D0%B8%D0%BE%D…
requires: Институциональная единица
requires: Страховое возмещение
requires: Текущий трансферт
term status: draft
definition: Выплаты компенсаций включают текущие трансферты, выплачиваемые одними институциональными единицами другим институциональным единицам в порядке компенсации за причиненный первыми ущерб физическим лицам или имуществу, которые не рассматриваются как выплаты страховых возмещений.
definition: Payments of compensation consist of current transfers paid by institutional units to other institutional units in compensation for injury to persons or damage to property caused by the former that are not settled as payments of non-life insurance claims.
in scheme: Глоссарий
preferred label: Payments of Compensation
related: Некоммерческие организации, обслуживающие домашние хозяйства
related: Институциональная единица
related: Органы государственного управления
top concept of: Глоссарий

Баланс активов и пассивов
type: Concept
comment: Баланс активов и пассивов может быть составлен для институциональных единиц, институциональных секторов и всей экономики.
source: Система национальных счетов 2008
  source: https://stat.semanticpro.org/xwiki/wiki/NationalAccounts/view/%D0%91%D0%B8%D0%B1%D0%BB%D0%B8%D0%BE%D1%82%D0%B5%D0%BA%D0%B0/%D0%A1%D0%B8%D1%81%D1%82%D0%B5%D0%BC%D0%B0%20%D0%BD%D0%B0%D1%86%D0%B8%D0%BE%D…
requires: Институциональная единица
requires: Обязательство
requires: Актив
term status: draft
alternative label: Statement of Financial Position
definition: A balance sheet is a statement, drawn up in respect of a particular point in time, of the values of assets owned and of the liabilities owed by an institutional unit or group of units.
definition: Баланс активов и пассивов — это отчет, составленный на определенный момент времени, содержащий данные о стоимости активов, находящихся в собственности институциональной единицы или группы институциональных единиц, и стоимости обязательств, которые приняты институциональной единицей или группой институциональных единиц.
in scheme: Глоссарий
preferred label: Balance Sheet
related: Институциональный сектор
related: Институциональная единица
top concept of: Глоссарий

Инвестиционный доход
type: Concept
comment: Условия, определяющие выплаты инвестиционного дохода, обычно оговариваются в финансовом инструменте, создаваемом при передаче средств от кредитора к заемщику. Такие сделки обычно заключаются только на ограниченный срок, по истечении которого соответствующие средства должны быть возвращены. Этот срок может составлять от нескольких месяцев до нескольких лет, а соответствующие сделки могут продлеваться.
source: Система национальных счетов 2008
  source: https://stat.semanticpro.org/xwiki/wiki/NationalAccounts/view/%D0%91%D0%B8%D0%B1%D0%BB%D0%B8%D0%BE%D1%82%D0%B5%D0%BA%D0%B0/%D0%A1%D0%B8%D1%81%D1%82%D0%B5%D0%BC%D0%B0%20%D0%BD%D0%B0%D1%86%D0%B8%D0%BE%D…
requires: Институциональная единица
requires: Финансовые активы
term status: draft
definition: Investment income is the income receivable by the owner of a financial asset in return for providing funds to another institutional unit.
definition: Инвестиционный доход — это доход, подлежащий получению собственником финансового актива за предоставление средств другой институциональной единице.
in scheme: Глоссарий
preferred label: Investment Income
top concept of: Глоссарий

Финансовые активы
type: Concept
comment: Золото в слитках, держателями которого в качестве резервного актива являются органы денежно-кредитного регулирования, рассматривается как финансовый актив, несмотря на то, что его держатели не имеют требований к каким-либо конкретным единицам. Акции рассматриваются как финансовые активы, несмотря на то, что финансовые требования их держателей к корпорациям не являются фиксированными или заранее установленными денежными величинами.
source: Система национальных счетов 2008
  source: https://stat.semanticpro.org/xwiki/wiki/NationalAccounts/view/%D0%91%D0%B8%D0%B1%D0%BB%D0%B8%D0%BE%D1%82%D0%B5%D0%BA%D0%B0/%D0%A1%D0%B8%D1%81%D1%82%D0%B5%D0%BC%D0%B0%20%D0%BD%D0%B0%D1%86%D0%B8%D0%BE%D…
requires: Финансовое требование
requires: Корпорация
requires: Резервные активы
requires: Другие виды участия в капитале
term status: draft
broader: Актив
definition: Финансовые активы включают все финансовые требования, акции или другие виды участия в капитале корпораций плюс золото в слитках, держателями которого в качестве резервного актива являются органы денежно-кредитного регулирования.
definition: Financial assets consist of all financial claims, shares or other equity in corporations plus gold bullion held by monetary authorities as a reserve asset.
example: Финансы: Классификации финансовых активов и обязательств основаны главным образом на характеристиках ликвидности и юридических характеристиках инструментов, которые определяют основополагающие отношения между кредитором и дебитором. Ликвидность финансового инструмента включает такие характеристики, как обращаемость, переводимость, реализуемость на рынке и конвертируемость.
in scheme: Глоссарий
preferred label: Financial assets
related: Финансовое требование
related: Корпорация
related: Резервные активы
top concept of: Глоссарий

Инвестиционные фонды
type: Concept
comment: Инвестиционные фонды включают взаимные фонды (паевые инвестиционные фонды открытого типа) и паевые тресты. Инвестиционные фонды выпускают акции, когда они организованы в форме корпорации, и паи, когда они организованы в форме трастовой компании. Акции инвестиционных фондов представляют собой акции, выпускаемые взаимными фондами, а не акции, которыми может владеть взаимный фонд. Инвестиционные фонды разделяются на фонды денежного рынка (ФДР) и инвестиционные фонды неденежного рынка. Фундаментальное различие между ними заключается в том, что ФДР обычно инвестируют в инструменты денежного рынка с остаточным сроком менее одного года, которые часто являются переводимыми и часто рассматриваются, как близкие аналоги депозитов. Инвестиционные фонды неденежного рынка обычно инвестируют в долго срочные финансовые активы и, возможно, в недвижимое имущество.
source: Система национальных счетов 2008
  source: https://stat.semanticpro.org/xwiki/wiki/NationalAccounts/view/%D0%91%D0%B8%D0%B1%D0%BB%D0%B8%D0%BE%D1%82%D0%B5%D0%BA%D0%B0/%D0%A1%D0%B8%D1%81%D1%82%D0%B5%D0%BC%D0%B0%20%D0%BD%D0%B0%D1%86%D0%B8%D0%BE%D…
requires: Предприятие
requires: Финансовые активы
term status: draft
definition: Инвестиционные фонды — это предприятия коллективного инвестирования, с помощью которых инвесторы объединяют средства для инвестирования в финансовые или нефинансовые активы.
definition: Investment funds are collective investment undertakings through which investors pool funds for investment in financial or non-financial assets.
in scheme: Глоссарий
preferred label: Investment Funds
related: Инвестиционные фонды неденежного рынка
related: Корпорация
related: Актив
related: Фонды денежного рынка
top concept of: Глоссарий

Обязательство
type: Concept
comment: Наиболее распространенное обстоятельство, при котором возникает обязательство – это юридически обязывающий контракт, в котором точно сформулированы сроки и условия платежей, которые должны быть произведены; такое обязательство в соответствии с контрактом является безусловным.
source: Система национальных счетов 2008
  source: https://stat.semanticpro.org/xwiki/wiki/NationalAccounts/view/%D0%91%D0%B8%D0%B1%D0%BB%D0%B8%D0%BE%D1%82%D0%B5%D0%BA%D0%B0/%D0%A1%D0%B8%D1%81%D1%82%D0%B5%D0%BC%D0%B0%20%D0%BD%D0%B0%D1%86%D0%B8%D0%BE%D…
term status: draft
definition: Обязательство возникает, когда одна единица (дебитор) обязуется при определенных обстоятельствах произвести платеж или ряд платежей другой единице (кредитору).
definition: A liability is established when one unit (the debtor) is obliged, under specific circumstances, to provide a payment or series of payments to another unit (the creditor).
example: Финансы: Во многих случаях обязательства (и соответствующие финансовые требования) явным образом определяются в официальных документах, представляющих отношения между дебиторами и кредиторами. В других случаях обязательства рассчитываются условно для отражения реальной экономической основы операции, как в случае создания условного кредита при приобретении актива в рамках финансового лизинга.
in scheme: Глоссарий
preferred label: Liability
top concept of: Глоссарий

Расходы на товары и услуги
type: Concept
comment: The buyer incurring the liability to pay need not be the same unit that takes possession of the good or service. As already noted, it is common for government units or NPISHs to pay for goods or services that the sellers provide to households. Moreover, as explained below, the liability incurred by the buyer does not necessarily have to be settled by a payment of cash.
comment: Покупатель, принимающий обязательство оплатить, не обязательно является той же самой единицей, которая становится владельцем товара или услуги. Как уже было отмечено, единицы сектора государственного управления или <a target="_blank" rel="noopener noreferrer" href="https://stat.semanticpro.org/xwiki/wiki/NationalAccounts/view/%D0%93%D0%BB%D0%BE%D1%81%D1%81%D0%B0%D1%80%D0%B8%D0%B8/%D0%9D%D0%B5%D0%BA%D0%BE%D0%BC%D0%BC%D0%B5%D1%80%D1%87%D0%B5%D1%81%D0%BA%D0%B8%D0%B5%20%D0%BE%D1%80%D0%B3%D0%B0%D0%BD%D0%B8%D0%B7%D0%B0%D1%86%D0%B8%D0%B8%2C%20%D0%BE%D0%B1%D1%81%D0%BB%D1%83%D0%B6%D0%B8%D0%B2%D0%B0%D1%8E%D1%89%D0%B8%D0%B5%20%D0%B4%D0%BE%D0%BC%D0%B0%D1%88%D0%BD%D0%B8%D0%B5%20%D1%85%D0%BE%D0%B7%D1%8F%D0%B9%D1%81%D1%82%D0%B2%D0%B0/">НКОДХ часто оплачивают товары или услуги, которые продавцы предоставляют домашним хозяйствам. Кроме этого, как объясняется ниже, обязательство, принятое покупателем, не обязательно должно быть погашено выплатой наличных денег.
source: Система национальных счетов 2008
  source: https://stat.semanticpro.org/xwiki/wiki/NationalAccounts/view/%D0%91%D0%B8%D0%B1%D0%BB%D0%B8%D0%BE%D1%82%D0%B5%D0%BA%D0%B0/%D0%A1%D0%B8%D1%81%D1%82%D0%B5%D0%BC%D0%B0%20%D0%BD%D0%B0%D1%86%D0%B8%D0%BE%D…
requires: Товары
requires: Институциональная единица
requires: Услуги
term status: draft
definition: Expenditures on goods and services are defined as the values of the amounts that buyers pay, or agree to pay, to sellers in exchange for goods or services that sellers provide to them or to other institutional units designated by the buyers.
definition: Расходы на товары и услуги определяются как суммы, которые покупатели платят или соглашаются выплатить продавцам в обмен на товары или услуги, которые продавцы предоставляют им или другим институциональным единицам, определяемым покупателями.
in scheme: Глоссарий
preferred label: Expenditures on Goods and Services
related: Некоммерческие организации, обслуживающие домашние хозяйства
related: Товары
related: Домашнее хозяйство
related: Обязательство
related: Услуги
top concept of: Глоссарий

Страховые технические резервы
type: Concept
comment: Они состоят из выплаченных, но еще не заработанных страховых премий (называемых незаработанными премиями), и страховых возмещений с наступившим сроком выплаты, но еще не выплаченных (называемых невыплаченными возмещениями); последние включают случаи, когда сумма выплаты является спорной или когда событие, ведущее к возникновению требования, произошло, но требование по нему еще не было заявлено. Единственными записями, отражаемыми в финансовом счете для страховых технических резервов (кроме резервов по страхованию жизни), являются корректировки для перехода к регистрации по методу начислений.
comment: They consist of premiums paid but not yet earned (called unearned premiums) and claims due but not yet settled, including cases where the amount is in dispute or the event leading to the claim has occurred but has not yet been reported (called claims outstanding). The only transactions for non-life insurance technical reserves recorded in the financial account are accrual adjustments.
source: Система национальных счетов 2008
  source: https://stat.semanticpro.org/xwiki/wiki/NationalAccounts/view/%D0%91%D0%B8%D0%B1%D0%BB%D0%B8%D0%BE%D1%82%D0%B5%D0%BA%D0%B0/%D0%A1%D0%B8%D1%81%D1%82%D0%B5%D0%BC%D0%B0%20%D0%BD%D0%B0%D1%86%D0%B8%D0%BE%D…
requires: Неурегулированные требования по страховым возмещениям
requires: Чистые страховые премии
requires: Страхование жизни
term status: draft
definition: Non-life insurance technical reserves consist of prepayments of net non-life insurance premiums and reserves to meet outstanding non-life insurance claims.
definition: Страховые технические резервы (кроме резервов по страхованию жизни) включают предварительные выплаты чистых страховых премий (кроме премий по страхованию жизни) и резервы для покрытия <a target="_blank" rel="noopener noreferrer" href="https://stat.semanticpro.org/xwiki/wiki/NationalAccounts/view/%D0%93%D0%BB%D0%BE%D1%81%D1%81%D0%B0%D1%80%D0%B8%D0%B8/%D0%9D%D0%B5%D1%83%D1%80%D0%B5%D0%B3%D1%83%D0%BB%D0%B8%D1%80%D0%BE%D0%B2%D0%B0%D0%BD%D0%BD%D1%8B%D0%B5%20%D1%82%D1%80%D0%B5%D0%B1%D0%BE%D0%B2%D0%B0%D0%BD%D0%B8%D1%8F%20%D0%BF%D0%BE%20%D1%81%D1%82%D1%80%D0%B0%D1%85%D0%BE%D0%B2%D1%8B%D0%BC%20%D0%B2%D0%BE%D0%B7%D0%BC%D0%B5%D1%89%D0%B5%D0%BD%D0%B8%D1%8F%D0%BC/">неурегулированных требований по страховым возмещениям (кроме возмещений по страхованию жизни).
in scheme: Глоссарий
preferred label: Insurance Technical Reserves
related: Страховое возмещение
related: Страхование жизни
related: Заработанная страховая премия
top concept of: Глоссарий

База данных
type: Concept
comment: Базы данных могут разрабатываться исключительно для собственного использования или на продажу в качестве самостоятельного объекта, или на продажу посредством лицензии на получение доступа к содержащейся информации. Вопрос о том, когда база данных для собственного использования, купленная база данных или лицензия на получение доступа к базе данных составляет актив, решается стандартным образом.
source: Система национальных счетов 2008
  source: https://stat.semanticpro.org/xwiki/wiki/NationalAccounts/view/%D0%91%D0%B8%D0%B1%D0%BB%D0%B8%D0%BE%D1%82%D0%B5%D0%BA%D0%B0/%D0%A1%D0%B8%D1%81%D1%82%D0%B5%D0%BC%D0%B0%20%D0%BD%D0%B0%D1%86%D0%B8%D0%BE%D…
term status: draft
alternative label: Data Warehouse
definition: Databases consist of files of data organized in such a way as to permit resource-effective access and use of the data.
definition: База данных состоит из файлов данных, организованных таким способом, чтобы обеспечить экономичный доступ к данным и их использование.
in scheme: Глоссарий
preferred label: Databases
related: Актив
top concept of: Глоссарий

Готовые продукты
type: Concept
comment: Продукт считается готовым, когда его производитель закончил намеченный процесс производства, даже при условии, что он может впоследствии использоваться для промежуточного потребления в других процессах производства. Таким образом, материальные оборотные средства в виде угля, произведенного предприятием добывающей промышленности, рассматриваются как готовые продукты, хотя запасы угля на тепловой электростанции классифицируются как сырье и материалы. Материальные оборотные средства в форме аккумуляторных батарей, произведенных изготовителем батарей, являются готовыми продуктами, хотя запасы тех же самых батарей у производителей автомобилей или самолетов будут отнесены к статье «сырье и материалы».
source: Система национальных счетов 2008
  source: https://stat.semanticpro.org/xwiki/wiki/NationalAccounts/view/%D0%91%D0%B8%D0%B1%D0%BB%D0%B8%D0%BE%D1%82%D0%B5%D0%BA%D0%B0/%D0%A1%D0%B8%D1%81%D1%82%D0%B5%D0%BC%D0%B0%20%D0%BD%D0%B0%D1%86%D0%B8%D0%BE%D…
requires: Товары
requires: Институциональная единица
term status: draft
definition: Finished goods consist of goods produced as outputs that their producer does not intend to process further before supplying them to other institutional units
definition: Готовые продукты состоят из произведенных товаров, которые производитель не намеревается подвергнуть дальнейшей обработке, прежде чем поставить их другим институциональным единицам.
in scheme: Глоссарий
preferred label: Finished Goods
related: Предприятие
related: Продукты
related: Материальные оборотные средства
related: Запасы
related: Промежуточное потребление
related: Сырье и материалы
related: Производство
top concept of: Глоссарий

Штрафы и пени
type: Concept
source: Система национальных счетов 2008
  source: https://stat.semanticpro.org/xwiki/wiki/NationalAccounts/view/%D0%91%D0%B8%D0%B1%D0%BB%D0%B8%D0%BE%D1%82%D0%B5%D0%BA%D0%B0/%D0%A1%D0%B8%D1%81%D1%82%D0%B5%D0%BC%D0%B0%20%D0%BD%D0%B0%D1%86%D0%B8%D0%BE%D…
requires: Институциональная единица
term status: draft
definition: Fines and penalties are compulsory payments imposed on institutional units by courts of law or quasi-judicial bodies.
definition: Штрафы и пени представляют собой обязательные платежи, которые должны производиться институциональными единицами в соответствии с решением суда или квазиюридической организации.
in scheme: Глоссарий
preferred label: Fines and Penalties
top concept of: Глоссарий