Квинтильные группы
type: Concept
comment: When constructing quintile groups, the population (households) is ranked by the level of average per capita disposable resources (income) in ascending order, and then divided into five equal groups, each of which includes 20% of the total population (households). As a result, the first quintile group (lowest) includes 20 per cent of the population (households) with the lowest level of average per capita disposable resources (income), the second quintile group includes the next 20 per cent of the population (households) and so on, and the fifth quintile group (highest) includes 20 per cent of the population (households) with the highest level of average per capita disposable resources (income).
comment: При построении квинтильных групп население (домашние хозяйства) ранжируется по уровню среднедушевых располагаемых ресурсов (доходов) в порядке их возрастания, а затем делится на пять равных групп, каждая из которых включает 20% всего населения (домашних хозяйств). В результате первая квинтильная группа (низшая) включает 20% населения (домашних хозяйств) с наименьшим уровнем среднедушевых располагаемых ресурсов (доходов), вторая квинтильная группа – последующие 20% населения (домашних хозяйств) и так далее, а пятая квинтильная группа (высшая) – 20% населения (домашних хозяйств) с наиболее высоким уровнем среднедушевых располагаемых ресурсов (доходов).
source: Краткий глоссарий статистических терминов
  source: https://suz.cisstat.org/xwiki/wiki/Agriculture/view/%D0%91%D0%B5%D0%BB%D0%B0%D1%80%D1%83%D1%81%D1%8C/%D0%91%D0%B8%D0%B1%D0%BB%D0%B8%D0%BE%D1%82%D0%B5%D0%BA%D0%B0/%D0%9A%D1%80%D0%B0%D1%82%D0%BA%D0%B8%D…
requires: Population
requires: Household
term status: submitted
broader: Квантильные группы
definition: Квинтильные группы — группы населения (домашних хозяйств), образованные путем деления всего населения (домашних хозяйств) на 5 численно равных частей.
definition: Quintile groups - groups of population (households) formed by dividing the total population (households) into 5 numerically equal parts.
in scheme: Глоссарий
preferred label: Quintile groups
related: Population
related: Household
top concept of: Глоссарий

Шкала эквивалентности
type: Concept
comment: Шкалы эквивалентности позволяют оценить благосостояние домохозяйств с помощью эквивалентного дохода, т.е. в расчете на условного члена домашнего хозяйства, что позволяет корректно учесть различия в реальной покупательной силе одинаковых по размеру доходов за счет экономии от ведения относительно большого хозяйства. Вот почему для обеспечения одинакового уровня благосостояния домашнему хозяйству, состоящему из двух человек, требуется 1,7 единицы дохода, тогда как домашнему хозяйству, состоящему из одного лица, необходимо иметь одну единицу дохода, а домашнему хозяйству, состоящему из трех человек – 2, 2 единицы дохода.
source:
  source: https://suz.cisstat.org/xwiki/wiki/StandardsOfLving/view/%D0%93%D0%B0%D1%80%D0%BC%D0%BE%D0%BD%D0%B8%D0%B7%D0%B0%D1%86%D0%B8%D1%8F/%D0%93%D0%B0%D1%80%D0%BC%D0%BE%D0%BD%D0%B8%D0%B7%D0%B0%D1%86%D0%B8%D1%…
requires: Weights
requires: Household
term status: submitted
definition: Шкала эквивалентности — совокупность весовых коэффициентов для пересчета общего числа членов домашнего хозяйства в число эквивалентных потребителей с учетом эффекта совместного проживания.
definition: Equivalence scale - a set of weighting factors for recalculating the total number of household members into the number of equivalent consumers, taking into account the effect of cohabitation.
in scheme: Глоссарий
preferred label: Equivalence scale
related: Благосостояние
related: Household
top concept of: Глоссарий

Вспомогательные помещения
type: Concept
source: Методологические пояснения по заполнению вопросника №18 СНГ по статистике жилищных условий населения
  source: https://suz.cisstat.org/xwiki/wiki/StandardsOfLving/view/%D0%91%D0%B8%D0%B1%D0%BB%D0%B8%D0%BE%D1%82%D0%B5%D0%BA%D0%B0/%D0%92%D0%BE%D0%BF%D1%80%D0%BE%D1%81%D0%BD%D0%B8%D0%BA%20%E2%84%9618%20%D0%A1%D0%9…
requires: Жилая квартира
term status: submitted
alternative label: Подсобные помещения
broader: Общая площадь жилищного фонда
definition: Auxiliary rooms are rooms located within the apartment: kitchens, corridors, toilets, bathrooms (showers), dressing rooms, storage rooms, built-in closets; in dormitories, in addition, there are also rooms for cultural, household and medical purposes.
definition: Вспомогательные помещения — помещения, расположенные в пределах квартиры: кухни, коридоры, санузлы, ванные (души), гардеробные комнаты, кладовые, встроенные шкафы; в общежитиях, кроме того, – комнаты культурно-бытового назначения и медицинского обслуживания.
in scheme: Глоссарий
preferred label: Auxiliary rooms
top concept of: Глоссарий

Бедность
type: Concept
comment: Существует широкий спектр подходов к измерению бедности, охватывающих как чисто монетарные, так и немонетарные аспекты бедности и допускающих многочисленные вариации. Прежде всего нужно определиться с тем, что необходимо измерить: доход, потребление или возможности в более общем плане. Наиболее распространенный подход заключается в измерении монетарной бедности на основе показателей уровня доходов или потребления, приближенно характеризующих материальный уровень жизни.
source: Энциклопедия статистических терминов Том 5, подраздел 5.5 «Статистика уровня и качества жизни населения»
  source: https://suz.cisstat.org/xwiki/wiki/StandardsOfLving/view/%D0%A0%D0%BE%D1%81%D1%81%D0%B8%D1%8F/%D0%91%D0%B8%D0%B1%D0%BB%D0%B8%D0%BE%D1%82%D0%B5%D0%BA%D0%B0/%D0%AD%D0%BD%D1%86%D0%B8%D0%BA%D0%BB%D0%BE%D0…
requires: Population
term status: submitted
broader: Уровень жизни
definition: Бедность — экономическое положение части населения и семей, имеющих относительно низкое обеспечение денежными, имущественными и иными ресурсами, при котором минимальные потребности индивида или семьи превышают имеющиеся средства для их удовлетворения.
definition: Poverty is the economic situation of a part of the population and families with relatively low provision of monetary, property and other resources, in which the minimum needs of an individual or family exceed the available means to meet them.
in scheme: Глоссарий
preferred label: Poverty
related: Consumption
related: Уровень жизни
top concept of: Глоссарий

Базовые услуги
type: Concept
comment: Перечень базовых услуг должен определяться исходя из местных потребностей и соответствовать концепции «доступности для всех категорий населения». К ним относятся, прежде всего, услуги, предоставляемые государством, которые имеют основополагающее значение для повышения уровня жизни населения.
source: Предложения по формированию модельного перечня базовых услуг и методов оценки их доступности для мониторинга ЦУР в регионе СНГ
  source: https://suz.cisstat.org/xwiki/wiki/StandardsOfLving/view/%D0%91%D0%B8%D0%B1%D0%BB%D0%B8%D0%BE%D1%82%D0%B5%D0%BA%D0%B0/%D0%9F%D1%80%D0%B5%D0%B4%D0%BB%D0%BE%D0%B6%D0%B5%D0%BD%D0%B8%D1%8F%20%D0%BF%D0%BE%…
requires: Services
requires: Основные потребности
term status: submitted
definition: Базовые услуги — услуги, которые позволяют обеспечить основные потребности человека в области питьевого водоснабжения, санитарии и гигиены, энергоснабжения, мобильности населения, сбора отходов, здравоохранения, образования и информационных технологий.
definition: Basic services - services include those that ensure basic human needs in the areas of drinking water supply, sanitation and hygiene, energy supply, population mobility, waste collection, health care, education and information technology.
in scheme: Глоссарий
preferred label: Basic services
related: Population
related: Services
related: Уровень жизни
top concept of: Глоссарий

Субъективная бедность
type: Concept
comment: Если при абсолютной концепции бедности граница бедности официально устанавливается государством, исходя из физиологически необходимой нормы для физического выживания человека, а при относительной фиксируется граница, за которой человек не может жить полноценной жизнью, то субъективная методика позволяет респонденту самому определить эту границу и оценить уровень своего собственного благосостояния. Субъективные показатели низкого дохода основываются на общественном мнении об уровнях дохода, которые считаются «едва-едва достаточными», и выводятся из обзоров домашних хозяйств.
source: Гармонизация понятия «Субъективная бедность»
  source: https://suz.cisstat.org/xwiki/wiki/StandardsOfLving/view/%D0%93%D0%B0%D1%80%D0%BC%D0%BE%D0%BD%D0%B8%D0%B7%D0%B0%D1%86%D0%B8%D1%8F/%D0%93%D0%B0%D1%80%D0%BC%D0%BE%D0%BD%D0%B8%D0%B7%D0%B0%D1%86%D0%B8%D1%…
requires: Population
requires: Благосостояние
requires: Бедность
term status: submitted
broader: Бедность
definition: Subjective poverty - a concept (the concept of poverty) based on the subjective opinion of the population regarding the assessment of the achieved level of well-being.
definition: Субъективная бедность — понятие (концепция бедности), основанное на субъективном мнении населения относительно оценки достигнутого уровня благосостояния.
in scheme: Глоссарий
preferred label: Subjective poverty
related: Благосостояние
related: Черта бедности
related: Household
related: Бедность
top concept of: Глоссарий

Квантильные группы
type: Concept
comment: Наиболее часто используется квинтильное (20-процентное) и децильное (10-процентное) деление.
source: Краткий глоссарий статистических терминов
  source: https://suz.cisstat.org/xwiki/wiki/Agriculture/view/%D0%91%D0%B5%D0%BB%D0%B0%D1%80%D1%83%D1%81%D1%8C/%D0%91%D0%B8%D0%B1%D0%BB%D0%B8%D0%BE%D1%82%D0%B5%D0%BA%D0%B0/%D0%9A%D1%80%D0%B0%D1%82%D0%BA%D0%B8%D…
requires: Population
requires: Household
term status: submitted
definition: Квантильные группы — группы населения (домашних хозяйств), образованные путем деления всего населения (домашних хозяйств) на численно равные части.
definition: Quantile groups - population groups (households) formed by dividing the entire population (households) into numerically equal parts.
in scheme: Глоссарий
preferred label: Quantile groups
related: Децильные группы
related: Квинтильные группы
top concept of: Глоссарий

Дифференциация доходов населения
type: Concept
comment: Для анализа дифференциации уровня жизни населения используются ряды распределения как по денежным доходам (ресурсам), так и по потребительским (денежным, совокупным) расходам.
source:
  source: https://suz.cisstat.org/xwiki/wiki/StandardsOfLving/view/%D0%93%D0%B0%D1%80%D0%BC%D0%BE%D0%BD%D0%B8%D0%B7%D0%B0%D1%86%D0%B8%D1%8F/%D0%93%D0%B0%D1%80%D0%BC%D0%BE%D0%BD%D0%B8%D0%B7%D0%B0%D1%86%D0%B8%D1%…
requires: Population
term status: submitted
alternative label: Неравенство доходов населения
definition: Дифференциация доходов населения — результат неравномерного распределения доходов в обществе, проявляющийся в различии уровней доходов, получаемых из различных источников и принадлежащих разным группам населения.
definition: Differentiation of the population's income is the result of unequal distribution of income in society, manifested in the difference in the levels of income received from different sources and belonging to different population groups.
in scheme: Глоссарий
preferred label: Differentiation of the population's income
related: Population
related: Уровень жизни
top concept of: Глоссарий

Благоустройство жилищного фонда
type: Concept
comment: Жилищный фонд считается оборудованным тем или иным видом благоустройства и в тех случаях, когда тот или иной вид благоустройства бездействует, например из-за ремонта.
source:
  source: https://suz.cisstat.org/xwiki/wiki/StandardsOfLving/view/%D0%93%D0%B0%D1%80%D0%BC%D0%BE%D0%BD%D0%B8%D0%B7%D0%B0%D1%86%D0%B8%D1%8F/%D0%93%D0%B0%D1%80%D0%BC%D0%BE%D0%BD%D0%B8%D0%B7%D0%B0%D1%86%D0%B8%D1%…
requires: Жилое помещение
term status: submitted
broader: Жилищный фонд
definition: Благоустройство жилищного фонда — оборудование жилых помещений отдельными видами благоустройства: водопроводом, канализацией, центральным отоплением, газом, горячим водоснабжением, ванными (душем) и тому подобным.
definition: Facilities of dwelling stock - equipping residential premises with individual types of amenities: water supply, sewerage, central heating, gas, hot water supply, bathrooms (showers), and the like.
in scheme: Глоссарий
preferred label: Facilities of dwelling stock
related: Жилищный фонд
top concept of: Глоссарий

Общая площадь жилищного фонда
type: Concept
source: Методологические пояснения по заполнению вопросника №18 СНГ по статистике жилищных условий населения
  source: https://suz.cisstat.org/xwiki/wiki/StandardsOfLving/view/%D0%91%D0%B8%D0%B1%D0%BB%D0%B8%D0%BE%D1%82%D0%B5%D0%BA%D0%B0/%D0%92%D0%BE%D0%BF%D1%80%D0%BE%D1%81%D0%BD%D0%B8%D0%BA%20%E2%84%9618%20%D0%A1%D0%9…
requires: Жилая площадь
requires: Вспомогательные помещения
term status: submitted
broader: Жилищный фонд
definition: Общая площадь жилищного фонда — жилая площадь и площадь вспомогательных (подсобных) помещений.
definition: Total housing stock is the living space and the area of auxiliary (utility) rooms.
in scheme: Глоссарий
preferred label: Total housing stock
top concept of: Глоссарий

Многомерная бедность
type: Concept
comment: В контексте измерения многомерной бедности вопрос о том, кто является бедным (по одному или нескольким пороговым значениям бедности), обычно решается на основе совмещенного распределения деприваций, испытываемых отдельными лицами или домашними хозяйствами, часто с использованием метода ранжирования по совокупности признаков бедности.
source:
  source: https://suz.cisstat.org/xwiki/wiki/StandardsOfLving/view/%D0%93%D0%B0%D1%80%D0%BC%D0%BE%D0%BD%D0%B8%D0%B7%D0%B0%D1%86%D0%B8%D1%8F/%D0%93%D0%B0%D1%80%D0%BC%D0%BE%D0%BD%D0%B8%D0%B7%D0%B0%D1%86%D0%B8%D1%…
requires: Household
requires: Services
term status: submitted
broader: Бедность
definition: Multidimensional poverty - the state of material inadequacy of an individual or household, measured by several parameters, including low income, lack of access to health care, lack of access to education, and poor living conditions.
definition: Многомерная бедность — состояние материальной недостаточности лица или домашнего хозяйства, измеренное по нескольким параметрам, в качестве которых используют низкий уровень дохода, отсутствие доступа к услугам здравоохранения, отсутствие и возможности получения образования, плохие условия проживания.
in scheme: Глоссарий
preferred label: Multidimensional poverty
related: Household
related: Бедность
top concept of: Глоссарий

Продовольственная безопасность
type: Concept
comment: Четырьмя основами продовольственной безопасности являются следующие: наличие, доступ, использование и стабильность. Аспект, касающийся питательности, является неотъемлемой частью концепции продовольственной безопасности.
source: Декларация Всемирного саммита по продовольственной безопасности
  source: https://suz.cisstat.org/xwiki/wiki/StandardsOfLving/view/%D0%91%D0%B8%D0%B1%D0%BB%D0%B8%D0%BE%D1%82%D0%B5%D0%BA%D0%B0/%D0%94%D0%B5%D0%BA%D0%BB%D0%B0%D1%80%D0%B0%D1%86%D0%B8%D1%8F%20%D0%92%D1%81%D0%B5%…
term status: submitted
definition: Продовольственная безопасность считается достигнутой при наличии у всех людей постоянного физического, социального и экономического доступа к достаточному количеству безопасной и питательной пищи, позволяющей удовлетворять их пищевые потребности и вкусовые предпочтения для ведения активного и здорового образа жизни.
definition: Food security exists when all people, at all times, have physical, social and economic access to sufficient, safe and nutritious food that meets their dietary needs and food preferences for an active and healthy life.
in scheme: Глоссарий
preferred label: Food security
top concept of: Глоссарий

Благосостояние
type: Concept
comment: Благосостояние может определяться как для отдельного индивида или домохозяйства, так и для социальных групп или населения в целом.
source: Большая российская энциклопедия
  source: https://suz.cisstat.org/xwiki/bin/view/%D0%91%D0%B8%D0%B1%D0%BB%D0%B8%D0%BE%D1%82%D0%B5%D0%BA%D0%B0/%D0%91%D0%BE%D0%BB%D1%8C%D1%88%D0%B0%D1%8F%20%D1%80%D0%BE%D1%81%D1%81%D0%B8%D0%B9%D1%81%D0%BA%D0%B0%…
term status: submitted
broader: Уровень жизни
definition: Благосостояние — социально-экономическая категория, включающая совокупность показателей достигнутого уровня и качества жизни и доступности основных общественных благ, обеспечивающих жизнедеятельность человека.
definition: Well-being is a socioeconomic category that encompasses a set of indicators of the achieved standard and quality of life and the availability of basic public goods that support human life.
in scheme: Глоссарий
preferred label: Well-being
related: Population
related: Household
top concept of: Глоссарий

Черта бедности
type: Concept
comment: Домохозяйство относят к категории бедных (или подверженных риску бедности), если его ресурсы не достигают величины установленного денежного порогового показателя («черта бедности»). Существует три основных подхода к установлению черты бедности: абсолютная черта бедности (или «иметь меньше объективно определенного абсолютного минимума»); относительная черта бедности (или «иметь меньше, чем другие»); субъективная черта бедности (или «ощущение того, что у вас недостаточно средств для того, чтобы сводить концы с концами»).
source: Руководство по измерению бедности
  source: https://suz.cisstat.org/xwiki/wiki/StandardsOfLving/view/%D0%91%D0%B8%D0%B1%D0%BB%D0%B8%D0%BE%D1%82%D0%B5%D0%BA%D0%B0/%D0%A0%D1%83%D0%BA%D0%BE%D0%B2%D0%BE%D0%B4%D1%81%D1%82%D0%B2%D0%BE%20%D0%BF%D0%BE%…
requires: Household
requires: Services
requires: Goods
requires: Основные потребности
term status: submitted
alternative label: Порог бедности
alternative label: Граница бедности
broader: Бедность
definition: Черта бедности представляет собой совокупную стоимость всех товаров и услуг, которые считаются необходимыми для удовлетворения основных потребностей домашнего хозяйства.
definition: Poverty line represents the aggregate value of all the goods and services considered necessary to satisfy the household’s basic needs.
in scheme: Глоссарий
preferred label: Poverty line
related: Относительная черта бедности
related: Household
related: Бедность
related: Абсолютная черта бедности
top concept of: Глоссарий

Жилой дом
type: Concept
source: Методологические положения по статистике жилищного фонда
  source: https://suz.cisstat.org/xwiki/wiki/StandardsOfLving/view/%D0%91%D0%B5%D0%BB%D0%B0%D1%80%D1%83%D1%81%D1%8C/%D0%91%D0%B8%D0%B1%D0%BB%D0%B8%D0%BE%D1%82%D0%B5%D0%BA%D0%B0/%D0%9C%D0%B5%D1%82%D0%BE%D0%B4%D0…
requires: Жилое помещение
term status: submitted
broader: Жилищный фонд
definition: Residential building – a capital structure (building, construction), half or more than half of the total area of which is the area of residential premises.
definition: Жилой дом — капитальное строение (здание, сооружение), половину или более половины общей площади которого составляет площадь жилых помещений.
in scheme: Глоссарий
preferred label: Residential building
top concept of: Глоссарий

Household
in scheme: Глоссарий
scope note: Рассматривает совокупность лиц, проживающих в одном жилом помещении (или его части), как связанных, так и не связанных отношениями родства. Домохозяйство может состоять и из одного человека, живущего самостоятельно и обеспечивающего себя пищей и всем необходимым для жизни.

Расходы домохозяйства на потребление
type: Concept
comment: В расходы на потребление не включается стоимость товаров, если они были приобретены не для собственного потребления.
source: Резолюция о статистике доходов и расходов домохозяйств, принятая 17-ой МКСТ
  source: https://suz.cisstat.org/xwiki/wiki/StandardsOfLving/view/%D0%9C%D0%B5%D1%82%D0%BE%D0%B4%D0%BE%D0%BB%D0%BE%D0%B3%D0%B8%D1%8F/%D0%A0%D0%B5%D0%B7%D0%BE%D0%BB%D1%8E%D1%86%D0%B8%D1%8F%20%D0%BE%20%D1%81%D1%…
requires: Production
requires: Household
requires: Services
requires: Goods
term status: submitted
broader: Расходы домохозяйства
definition: Расходы домохозяйства на потребление — это стоимость товаров и услуг, приобретаемых, используемых или оплачиваемых домохозяйством путем прямых денежных покупок, собственного производства, бартерного обмена или дохода в натуральной форме для удовлетворения потребностей и пожеланий своих членов.
definition: Household consumption expenditure is the value of consumer goods and services acquired, used or paid for by a household through direct monetary purchases, own-account production, barter or as income in-kind for the satisfaction of the needs and wants of its members.
in scheme: Глоссарий
preferred label: Household consumption expenditure
related: Consumption
related: Goods
top concept of: Глоссарий

Потребительская корзина
type: Concept
comment: Составы потребительских корзин разрабатываются и утверждаются соответствующими правительственными органами стран СНГ и имеют существенные отличия, связанные с национальными, природно-климатическими и другими особенностями.
source:
  source: https://suz.cisstat.org/xwiki/wiki/StandardsOfLving/view/%D0%93%D0%B0%D1%80%D0%BC%D0%BE%D0%BD%D0%B8%D0%B7%D0%B0%D1%86%D0%B8%D1%8F/%D0%93%D0%B0%D1%80%D0%BC%D0%BE%D0%BD%D0%B8%D0%B7%D0%B0%D1%86%D0%B8%D1%…
requires: Non-foodgoods
requires: Services
requires: Products
term status: submitted
alternative label: Минимальная потребительская корзина
definition: Потребительская корзина — минимальный набор продуктов питания, непродовольственных товаров и услуг, необходимых для сохранения здоровья человека и обеспечения его жизнедеятельности.
definition: Basket of consumer goods and services - minimum sets of food products, non-food goods and services necessary to maintain human health and ensure life.
in scheme: Глоссарий
preferred label: Basket of consumer goods and services
top concept of: Глоссарий

Жилая квартира
type: Concept
comment: Квартира может состоять из одной или нескольких жилых комнат. Коммунальной считается квартира, в которой проживает 2 и более квартиросъемщика.
source: Методологические пояснения по заполнению вопросника №18 СНГ по статистике жилищных условий населения
  source: https://suz.cisstat.org/xwiki/wiki/StandardsOfLving/view/%D0%91%D0%B8%D0%B1%D0%BB%D0%B8%D0%BE%D1%82%D0%B5%D0%BA%D0%B0/%D0%92%D0%BE%D0%BF%D1%80%D0%BE%D1%81%D0%BD%D0%B8%D0%BA%20%E2%84%9618%20%D0%A1%D0%9…
term status: submitted
alternative label: Квартира
broader: Жилищный фонд
definition: Residential apartment is a room equipped and used for permanent residence, separated from other adjacent rooms by walls without openings or blank partitions. It must be equipped with separate rooms for kitchen, restroom, bathroom, as well as have an independent exit to the stairwell, common lobby or directly to the street.
definition: Жилая квартира — помещение, оборудованное и используемое для постоянного проживания, отделенное от других смежных помещений стенами без проемов или глухими перегородками. Она должна быть оборудована отдельными помещениями, предназначенными для кухни, уборной, ванной, а также иметь самостоятельный выход на лестничную клетку, в общий вестибюль или непосредственно на улицу.
in scheme: Глоссарий
preferred label: Residential apartment
top concept of: Глоссарий

Абсолютная бедность
type: Concept
comment: В странах Содружества наиболее широкое распространение получила концепция абсолютной бедности, основанная на соответствии доходов или расходов населения установленному минимуму средств существования.
source:
  source: https://suz.cisstat.org/xwiki/wiki/StandardsOfLving/view/%D0%93%D0%B0%D1%80%D0%BC%D0%BE%D0%BD%D0%B8%D0%B7%D0%B0%D1%86%D0%B8%D1%8F/%D0%93%D0%B0%D1%80%D0%BC%D0%BE%D0%BD%D0%B8%D0%B7%D0%B0%D1%86%D0%B8%D1%…
requires: Population
requires: Бедность
term status: submitted
broader: Бедность
definition: Абсолютная бедность — понятие (концепция бедности), основанное на соответствии доходов или расходов населения установленному минимуму средств существования.
definition: Absolute poverty is a concept (a concept of poverty) based on the compliance of the population's income or expenses with the established minimum standard of living.
in scheme: Глоссарий
preferred label: Absolute poverty
related: Population
top concept of: Глоссарий

Уровень жизни
type: Concept
comment: Для характеристики уровня жизни изучаются доходы и расходы населения, динамика их изменения и дифференциация различных групп населения по уровню доходов, потребление благ и услуг культурно-бытового назначения, обеспеченность жильем, занятость населения, использование им внерабочего времени, развитие системы здравоохранения, образования, физической культуры, социальное обеспечение и др. Показатели уровня жизни характеризуют фактический уровень жизни населения страны в целом, в разрезе его отдельных групп, типов домашних хозяйств, а также в региональном разрезе.
source: Словарь терминов по социальной статистике
  source: https://suz.cisstat.org/xwiki/wiki/LabourMarket/view/%D0%91%D0%B8%D0%B1%D0%BB%D0%B8%D0%BE%D1%82%D0%B5%D0%BA%D0%B0/%D0%A1%D0%BB%D0%BE%D0%B2%D0%B0%D1%80%D1%8C%20%D1%82%D0%B5%D1%80%D0%BC%D0%B8%D0%BD%D0%B…
requires: Production
term status: submitted
definition: Standard of living is the degree of satisfaction of the population's needs for material and spiritual goods in an inextricable connection with social conditions of life and the development of production.
definition: Уровень жизни — степень удовлетворения потребностей населения в материальных и духовных благах в неразрывной связи с социальными условиями жизни и развитием производства.
in scheme: Глоссарий
preferred label: Standard of living
related: EmploymentWork
related: Population
related: Consumption
related: Household
related: Services
related: Дифференциация доходов населения
top concept of: Глоссарий

Основные потребности
type: Concept
comment: Основные потребности включают два элемента: минимальные потребительские потребности семьи (т. е. потребности в достаточном питании, жилье и одежде, а также в некоторых предметах домашней мебели и утвари); и основные коммунальные услуги, предоставляемые для общественного потребления, такие как безопасное водоснабжение, услуги санитарии, общественного транспорта, здравоохранения, образования и услуги культурного характера. Кроме того, в сельских районах к основным потребностям относятся также доступ к земле, к сельскохозяйственной технике и возможность ведения сельского хозяйства.
source: Руководство по измерению бедности
  source: https://suz.cisstat.org/xwiki/wiki/StandardsOfLving/view/%D0%91%D0%B8%D0%B1%D0%BB%D0%B8%D0%BE%D1%82%D0%B5%D0%BA%D0%B0/%D0%A0%D1%83%D0%BA%D0%BE%D0%B2%D0%BE%D0%B4%D1%81%D1%82%D0%B2%D0%BE%20%D0%BF%D0%BE%…
requires: Services
term status: submitted
broader: Уровень жизни
definition: Basic needs - include two elements: the minimum consumption needs of a family (i.e., adequate food, shelter and clothing, as well as certain household furniture and equipment); and essential services provided by and for the community at large, such as safe water, sanitation, public transport and health care, education, and cultural facilities. Furthermore, in rural areas, basic needs also include land, agricultural tools, and access to farming.
definition: Основные потребности — представляют собой расширенный вариант концепции прожиточного минимума. Помимо материальных потребностей, удовлетворение которых необходимо для физического выживания индивида, в концепцию «основных потребностей» включается также доступ к таким коллективным и индивидуальным услугам, как услуги здравоохранения, санитарии и образования.
in scheme: Глоссарий
preferred label: Basic needs
related: Consumption
related: Services
top concept of: Глоссарий

Частный жилищный фонд
type: Concept
comment: К частному жилищному фонду относится фонд, находящийся в собственности граждан: индивидуальные жилые дома, приватизированные, построенные и приобретенные квартиры и дома, квартиры в домах жилищных и жилищно-строительных кооперативов с полностью выплаченным паевым взносом, в домах товариществ индивидуальных владельцев квартир, квартиры и дома, приобретенные в собственность гражданами на иных основаниях, предусмотренных законодательством; фонд, находящийся в собственности юридических лиц (созданных в качестве частных собственников), построенный или приобретенный за счет их средств, в том числе за счет средств жилищных, жилищно-строительных кооперативов с не полностью выплаченным паевым взносом.
source: Гармонизация понятия «Частный жилищный фонд»
  source: https://suz.cisstat.org/xwiki/wiki/StandardsOfLving/view/%D0%93%D0%B0%D1%80%D0%BC%D0%BE%D0%BD%D0%B8%D0%B7%D0%B0%D1%86%D0%B8%D1%8F/%D0%93%D0%B0%D1%80%D0%BC%D0%BE%D0%BD%D0%B8%D0%B7%D0%B0%D1%86%D0%B8%D1%…
requires: LegalEntity
requires: Жилое помещение
term status: submitted
broader: Жилищный фонд
definition: Частный жилищный фонд — совокупность жилых помещений, находящихся в собственности граждан и в собственности юридических лиц.
definition: Private housing stock is a collection of dwelling rooms owned by individuals and legal entities.
in scheme: Глоссарий
preferred label: Private housing stock
related: Жилая квартира
related: LegalEntity
related: Жилой дом
top concept of: Глоссарий

ConsumptionGoodOrService
in scheme: Глоссарий
scope note: В разделе «Уровень и условия жизни» применяется только к домохозяйствам и отражает личный характер потребления.

Относительная черта бедности
type: Concept
source: Руководство по измерению бедности
  source: https://suz.cisstat.org/xwiki/wiki/StandardsOfLving/view/%D0%91%D0%B8%D0%B1%D0%BB%D0%B8%D0%BE%D1%82%D0%B5%D0%BA%D0%B0/%D0%A0%D1%83%D0%BA%D0%BE%D0%B2%D0%BE%D0%B4%D1%81%D1%82%D0%B2%D0%BE%20%D0%BF%D0%BE%…
term status: submitted
alternative label: Черта относительной малообеспеченности
broader: Черта бедности
definition: Relative poverty line is an explicit function of the income (or consumption expenditure) distribution, namely, a constant fraction of some income standard.
definition: Относительная черта бедности — непосредственная функция распределения доходов (или потребительских расходов), т. е. постоянная доля некоего стандарта дохода.
in scheme: Глоссарий
preferred label: Relative poverty line
top concept of: Глоссарий

Расходы домохозяйства
type: Concept
comment: Расходы домохозяйства представляют собой полную сумму средств, расходуемых домохозяйством для удовлетворения своих потребностей и выполнения своих «юридических» обязательств.
source: Резолюция о статистике доходов и расходов домохозяйств, принятая 17-ой МКСТ
  source: https://suz.cisstat.org/xwiki/wiki/StandardsOfLving/view/%D0%9C%D0%B5%D1%82%D0%BE%D0%B4%D0%BE%D0%BB%D0%BE%D0%B3%D0%B8%D1%8F/%D0%A0%D0%B5%D0%B7%D0%BE%D0%BB%D1%8E%D1%86%D0%B8%D1%8F%20%D0%BE%20%D1%81%D1%…
requires: Consumption
requires: Расходы домохозяйства на потребление
term status: submitted
definition: Household expenditure is defined as the sum of household consumption expenditure and the non-consumption expenditures of the household.
definition: Расходы домохозяйства — это сумма расходов домохозяйства на потребление и расходов домохозяйства, не связанных с потреблением.
in scheme: Глоссарий
preferred label: Household expenditure
related: Household
top concept of: Глоссарий

Доход домашнего хозяйства
type: Concept
comment: Доходы домохозяйства доступны для текущего потребления и не уменьшают собственный капитал домохозяйства за счет сокращения его денежных средств, расходования иных финансовых и нефинансовых активов или увеличения его обязательств. Доход домохозяйства может охватывать: i) трудовой доход (как по найму, так и от самозанятости), ii) доход от собственности, iii) доход от производства услуг домохозяйством для собственного потребления, iv) полученные текущие трансферты (за исключением социальных трансфертов в натуральной форме), и v) социальные трансферты в натуральной форме.
source: Руководство по измерению бедности
  source: https://suz.cisstat.org/xwiki/wiki/StandardsOfLving/view/%D0%91%D0%B8%D0%B1%D0%BB%D0%B8%D0%BE%D1%82%D0%B5%D0%BA%D0%B0/%D0%A0%D1%83%D0%BA%D0%BE%D0%B2%D0%BE%D0%B4%D1%81%D1%82%D0%B2%D0%BE%20%D0%BF%D0%BE%…
requires: Household
requires: Services
term status: submitted
definition: Household income consists of all receipts whether monetary or in kind (goods and services) that are received by the household or by individual members of the household at annual or more frequent intervals, but excludes windfall gains and other such irregular and typically one-time receipts.
definition: Доход домашнего хозяйства — все поступления в денежной форме, в натуральной форме и в форме услуг, которые это домохозяйство или его отдельные члены получают на годовой или более частой основе, за исключением внезапных заработков и иных подобных нерегулярных и обычно разовых поступлений.
in scheme: Глоссарий
preferred label: Household income
related: Liability
related: Consumption
related: Household
related: FinancialAssets
related: Asset
related: CurrentTransfer
top concept of: Глоссарий

Социальная исключенность
type: Concept
comment: Социальная исключенность может иметь место в различных сферах жизни, такие как рынок труда, государственные учреждения и услуги, потребление, производство, политическая активность и социальные отношения и, соответственно, имеет много измерений, таких как бедность, отсутствие базовых компетенций, ограниченные возможности трудоустройства и получения образования, а также недостаточный доступ к социальным и общинным сетям и мероприятиям.
source: Гармонизация понятия «Cоциальная исключенность»
  source: https://suz.cisstat.org/xwiki/wiki/StandardsOfLving/view/%D0%93%D0%B0%D1%80%D0%BC%D0%BE%D0%BD%D0%B8%D0%B7%D0%B0%D1%86%D0%B8%D1%8F/%D0%93%D0%B0%D1%80%D0%BC%D0%BE%D0%BD%D0%B8%D0%B7%D0%B0%D1%86%D0%B8%D1%…
term status: submitted
alternative label: Социальная изоляция Социальное отчуждение
definition: Социальная исключенность — процесс, в результате которого отдельные лица или группы оказываются или продолжают находиться в систематически неблагоприятном положении, что мешает их полноценному участию в социальной, экономической, культурной и политической жизни. Как результат социальная исключенность отражает статус и особенности соответствующего человека.
definition: Social exclusion - the term can refer to specific aspects of life, such as exclusion from the labour force, consumption, or social rights, or more general forms of exclusion across multiple or all spheres of society.
in scheme: Глоссарий
preferred label: Social exclusion
related: Production
related: Consumption
related: Бедность
related: Services
top concept of: Глоссарий

Жилая площадь
type: Concept
comment: В жилую площадь не включаются подсобные помещения, а также жилые квартиры и комнаты, предназначенные для жилья, но используемые для других целей (конторы, магазины, аптеки и др.).
source: Методологические пояснения по заполнению вопросника №18 СНГ по статистике жилищных условий населения
  source: https://suz.cisstat.org/xwiki/wiki/StandardsOfLving/view/%D0%91%D0%B8%D0%B1%D0%BB%D0%B8%D0%BE%D1%82%D0%B5%D0%BA%D0%B0/%D0%92%D0%BE%D0%BF%D1%80%D0%BE%D1%81%D0%BD%D0%B8%D0%BA%20%E2%84%9618%20%D0%A1%D0%9…
requires: Жилая квартира
requires: Жилой дом
term status: submitted
broader: Общая площадь жилищного фонда
definition: Жилая площадь — площадь жилых комнат в квартирах, домах и помещениях; к ней относятся также предназначенные и используемые для проживания спальные, столовые комнаты, комнаты для отдыха и внеклассных занятий в интернатах, детских домах и общежитиях учебных заведений, домах инвалидов и престарелых и т.д.; жилые комнаты в нежилых строениях и помещениях - в школах, больницах, поликлиниках, жилые комнаты, временно пустующие по каким-либо причинам (ремонта, переоборудования и т.д.).
definition: Living space - the space of living rooms in apartments, houses and premises; it also includes bedrooms, dining rooms, rooms for recreation and extracurricular activities in boarding schools, orphanages and dormitories of educational institutions, homes for the disabled and the elderly, etc.; living rooms in non-residential buildings and premises - in schools, hospitals, clinics, living rooms temporarily empty for any reason (repairs, re-equipment, etc.).
in scheme: Глоссарий
preferred label: Living space
related: Жилая квартира
related: Вспомогательные помещения
top concept of: Глоссарий

Материальная депривация
type: Concept
comment: Материальная депривация относится к состоянию экономического напряжения и нехватки товаров длительного пользования, определяемому как вынужденная невозможность (а не выбор не делать этого) оплачивать непредвиденные расходы, позволить себе недельный ежегодный отпуск вне дома, обед из мяса, курицы или рыбы через день, нормальное отопление жилья, товары длительного пользования, такие как стиральная машина, цветной телевизор, телефон или автомобиль, необходимость иметь задолженность по платежам (ипотека или арендная плата, счета за коммунальные услуги, рассрочка или другие платежи по кредитам).
source:
  source: https://suz.cisstat.org/xwiki/wiki/StandardsOfLving/view/%D0%93%D0%B0%D1%80%D0%BC%D0%BE%D0%BD%D0%B8%D0%B7%D0%B0%D1%86%D0%B8%D1%8F/%D0%93%D0%B0%D1%80%D0%BC%D0%BE%D0%BD%D0%B8%D0%B7%D0%B0%D1%86%D0%B8%D1%…
requires: Population
requires: Household
term status: submitted
definition: Material deprivation is a hardship caused by a lack of financial resources, the presence of which leads the population (households) to exclusion from the generally accepted way of life in the country
definition: Материальная депривация — вызванные недостатком денежных средств лишения, наличие которых приводит население (домашние хозяйства) к исключению из общепринятого образа жизни в стране.
in scheme: Глоссарий
preferred label: Material deprivation
related: DurableGood
related: Services
top concept of: Глоссарий

Децильные группы
type: Concept
comment: При построении децильных групп население (домашних хозяйств) ранжируется по уровню среднедушевых располагаемых ресурсов (доходов) в порядке их возрастания, а затем делится на десять равных групп, каждая из которых включает 10% всего населения (домашних хозяйств). В результате первая децильная группа (низшая) включает 10% населения (домашних хозяйств) с наименьшим уровнем среднедушевых располагаемых ресурсов (доходов), вторая децильная группа — последующие 10% населения (домашних хозяйств) и так далее, а десятая децильная группа (высшая) — 10% населения (домашних хозяйств) с наиболее высоким уровнем среднедушевых располагаемых ресурсов (доходов).
comment: When constructing decile groups, the population (households) is ranked by the level of average per capita disposable resources (income) in ascending order, and then divided into ten equal groups, each of which includes 10% of the total population (households). As a result, the first decile group (lowest) includes 10 per cent of the population (households) with the lowest level of average per capita disposable resources (income), the second decile group includes the next 10 per cent of the population (households) and so on, and the tenth decile group (highest) includes 10 per cent of the population (households) with the highest level of average per capita disposable resources (income).
source: Краткий глоссарий статистических терминов
  source: https://suz.cisstat.org/xwiki/wiki/Agriculture/view/%D0%91%D0%B5%D0%BB%D0%B0%D1%80%D1%83%D1%81%D1%8C/%D0%91%D0%B8%D0%B1%D0%BB%D0%B8%D0%BE%D1%82%D0%B5%D0%BA%D0%B0/%D0%9A%D1%80%D0%B0%D1%82%D0%BA%D0%B8%D…
requires: Population
requires: Household
term status: submitted
broader: Квантильные группы
definition: Decile groups - groups of population (households) formed by dividing the total population (households) into 10 numerically equal parts.
definition: Децильные группы — группы населения (домашних хозяйств), образованные путем деления всего населения (домашних хозяйств) на 10 численно равных частей.
in scheme: Глоссарий
preferred label: Decile groups
related: Population
related: Household
top concept of: Глоссарий

Глоссарий
type: ConceptScheme
comment: При разработке глоссария использовались результаты анализа документов и материалов, внешних источников, словарей и энциклопедий по разделу, а также результаты гармонизации понятий.
version info: 48.1
definition: Глоссарий представляет собой словарь узкоспециализированных терминов раздела и формируется на основе анализа методологических документов, толковых словарей и энциклопедий в области статистики уровня и условий жизни. Глоссарий реализован как совокупность концептов, имеющих толкование (лексическое отражение), с поддержкой мультиязычности, комментариев и примеров, а также семантических отношений между концептами.
has top concept: Частный жилищный фонд
has top concept: Квинтильные группы
has top concept: Шкала эквивалентности
has top concept: Бедность
has top concept: Вспомогательные помещения
has top concept: Базовые услуги
has top concept: Субъективная бедность
has top concept: Относительная черта бедности
has top concept: Расходы домохозяйства
has top concept: Квантильные группы
has top concept: Доход домашнего хозяйства
has top concept: Дифференциация доходов населения
has top concept: Общая площадь жилищного фонда
has top concept: Благоустройство жилищного фонда
has top concept: Многомерная бедность
has top concept: Социальная исключенность
has top concept: Продовольственная безопасность
has top concept: Жилая площадь
has top concept: Материальная депривация
has top concept: Децильные группы
has top concept: Благосостояние
has top concept: Черта бедности
has top concept: Жилой дом
has top concept: Расходы домохозяйства на потребление
has top concept: Абсолютная черта бедности
has top concept: Потребительская корзина
has top concept: Жилая квартира
has top concept: Жилищный фонд
has top concept: Относительная бедность
has top concept: Жилое помещение
has top concept: Абсолютная бедность
has top concept: Уровень жизни
has top concept: Основные потребности

Абсолютная черта бедности
type: Concept
comment: Один из методов, который используется для определения абсолютной черты бедности, основан на расчете прожиточного минимума и в основном применяется в странах СНГ.
source: Руководство по измерению бедности
  source: https://suz.cisstat.org/xwiki/wiki/StandardsOfLving/view/%D0%91%D0%B8%D0%B1%D0%BB%D0%B8%D0%BE%D1%82%D0%B5%D0%BA%D0%B0/%D0%A0%D1%83%D0%BA%D0%BE%D0%B2%D0%BE%D0%B4%D1%81%D1%82%D0%B2%D0%BE%20%D0%BF%D0%BE%…
requires: Services
requires: Уровень жизни
requires: Goods
term status: submitted
alternative label: Черта малообеспеченности
broader: Черта бедности
definition: Absolute poverty line is the monetary value of a set goods and services considered to achieve a minimally acceptable standard of living.
definition: Абсолютная черта бедности — денежная стоимость набора товаров и услуг, которые считаются необходимыми для достижения минимально приемлемого уровня жизни.
in scheme: Глоссарий
preferred label: Absolute poverty line
top concept of: Глоссарий

DurableGood
in scheme: Глоссарий
scope note: Термин используется только в потребительском контексте, отражает личный характер потребления и применяется к потребительским товарам, используемые многократно без снижения их способности удовлетворять потребности и пожелания потребителей.

Жилищный фонд
type: Concept
comment: Жилищный фонд распределяется в соответствии с национальным жилищным законодательством по основным формам собственности: частный, государственный, муниципальный, общественный.
requires: Жилая квартира
requires: Жилое помещение
requires: Жилой дом
term status: submitted
definition: Жилищный фонд — совокупность всех жилых помещений независимо от форм собственности, включая жилые дома, специализированные дома (общежития, приюты, дома маневренного фонда, специальные дома для одиноких престарелых, детские дома, дома-интернаты для инвалидов, ветеранов, интернаты при школах и школы-интернаты), квартиры, служебные, жилые помещения, иные жилые помещения в других строениях, пригодные для проживания.
definition: Dwelling stock – the totality of all residential premises irrespective of the form of ownership, including residential houses, specialized houses (hostels, shelters, maneuvering fund houses, special houses for single elderly people, children's homes, boarding houses for disabled people, veterans, boarding schools), apartments, service, residential premises, other residential premises in other buildings suitable for living.
in scheme: Глоссарий
preferred label: Dwelling stock
top concept of: Глоссарий

Относительная бедность
type: Concept
comment: Относительная бедность описывается как ситуация, в которой люди не располагают ресурсами для того, чтобы приобретать продукты питания, принимать участие в деятельности и иметь условия жизни и удобства, которые являются обычными или, по меньшей мере, широко поощряются или одобряются в обществах, которым они принадлежат. Их ресурсы настолько ниже тех, которыми должна располагать среднестатистическая семья, что они фактически оказываются исключены из традиционного уклада жизни с ее обычаями и видами деятельности.
source:
  source: https://suz.cisstat.org/xwiki/wiki/StandardsOfLving/view/%D0%93%D0%B0%D1%80%D0%BC%D0%BE%D0%BD%D0%B8%D0%B7%D0%B0%D1%86%D0%B8%D1%8F/%D0%93%D0%B0%D1%80%D0%BC%D0%BE%D0%BD%D0%B8%D0%B7%D0%B0%D1%86%D0%B8%D1%…
requires: Population
requires: Бедность
term status: submitted
broader: Бедность
definition: Относительная бедность — понятие (концепция бедности), основанное на соответствии доходов или расходов населения их медианным значениям.
definition: Relative poverty - a concept (concept of poverty) based on the correspondence of the population's income or expenses to their median values.
in scheme: Глоссарий
preferred label: Relative poverty
related: Products
top concept of: Глоссарий

Жилое помещение
type: Concept
comment: К жилым помещениям относятся: жилой дом, часть жилого дома; квартира, часть квартиры; комната.
source:
  source: https://suz.cisstat.org/xwiki/wiki/StandardsOfLving/view/%D0%93%D0%B0%D1%80%D0%BC%D0%BE%D0%BD%D0%B8%D0%B7%D0%B0%D1%86%D0%B8%D1%8F/%D0%93%D0%B0%D1%80%D0%BC%D0%BE%D0%BD%D0%B8%D0%B7%D0%B0%D1%86%D0%B8%D1%…
term status: submitted
broader: Жилищный фонд
definition: Dwelling room is premises intended for the habitation of citizens, heated, having natural lighting and corresponding to mandatory sanitary norms and rules, hygienic standards and other mandatory technical regulatory legal acts containing requirements imposed on residential premises.
definition: Жилое помещение — предназначенное для проживания граждан помещение, отапливаемое, имеющее естественное освещение и соответствующее обязательным для соблюдения санитарным нормам и правилам, гигиеническим нормативам и иным обязательным для соблюдения техническим нормативным правовым актам, содержащим требования, предъявляемые к жилым помещениям.
in scheme: Глоссарий
preferred label: Dwelling room
related: Жилая квартира
related: Жилой дом
top concept of: Глоссарий

Consumption
in scheme: Глоссарий
scope note: Термин используется преимущественно в контексте оценки уровня жизни и материального благополучия населения, где важен индивидуальный характер удовлетворения потребностей